Tasks

Browse the tasks

Most tasks start from a real report on a public project; Lite tasks start from projects that AI coding agents wrote. A candidate becomes a task once we have reproduced its failure and fixed it by changing its environment only, both in a clean container.

3,609 shownFor entries that are not tasks, the category comes from the report text only.
python#63

spotify/basic-pitch

Dependencies Issue

ERROR: Cannot install basic-pitch==0.0.1, basic-pitch==0.1.0 and basic-pitch==0.2.0 because these package versions have conflicting dependencies.

Reported2023-02-26Inspect
python#430

CycloneDX/cyclonedx-python-lib

remove lock files

No identifying execution failure has been captured.

Already works2023-09-12Inspect
java#4358

JanusGraph/janusgraph

Publish SBOM

No identifying execution failure has been captured.

Already works2024-04-03Inspect
java#479

Konloch/bytecode-viewer

Webp

No identifying execution failure has been captured.

Already works2023-12-30Inspect
cpp#58

Slackadays/Clipboard

Encoding issue in CJK locales

C:\Users\hp\Desktop\Clipboard\src\clipboard\src\clipboard.cpp(683,228): error C2001: newline in constant [C:\Users\hp\Desktop\Clipboard\build\src\clipboard\clipboard.vcxp

Already works2023-01-31Inspect
cpp#1664

Tencent/TNN

Cross-platform compile error

/usr/lib/gcc-cross/arm-linux-gnueabihf/9/../../../../arm-linux-gnueabihf/bin/ld: error: libTNN.so.0.3.0.0 uses VFP register arguments, source/tnn/device/arm/CMakeFiles/TN

Already works2022-05-20Inspect
python#6181

Textualize/textual

tree-sitter-sql pin no longer necessary

Prior to that, in #5552, you pinned tree-sitter-sql to <0.3.8, since versions above that were incompatible with tree-sitter <0.25.0 and would cause a runtime error.

Already works2025-10-20Inspect
javascript#100

acornjs/acorn-jsx

Acorn v7.0

No identifying execution failure has been captured.

Already works2019-08-13Inspect
python#501

adrienverge/yamllint

Publish wheels

No identifying execution failure has been captured.

Already works2022-10-08Inspect
cpp#4562

alibaba/MNN

Android 0.8.3 文生图模型点击crash

06-23 17:57:04.538 22194 22304 E AndroidRuntime: java.lang.UnsatisfiedLinkError: No implementation found for long com.alibaba.mnnllm.android.llm.DiffusionSession.initNati

Already works2026-06-23Inspect
java#4867

alibaba/spring-ai-alibaba

[BUG]

No identifying execution failure has been captured.

Already works2026-07-29Inspect
java#7730

apache/incubator-seata

cannot find jdbc folder

I use Docker deployment versions: 2.5.0, 2.4.0, 2.3.0 all have this error. Do I need to additionally download the JDBC jar package and mount it inside the container? I ch

Already works2025-10-25Inspect
java#7730

apache/incubator-seata

cannot find jdbc folder

I use Docker deployment versions: 2.5.0, 2.4.0, 2.3.0 all have this error. Do I need to additionally download the JDBC jar package and mount it inside the container? I ch

Already works2025-10-25Inspect
java#822

apache/rocketmq-externals

[Travis CI] Build Failed

ERROR: /home/travis/.travis/functions: line 109: cd: rocketmq-flink: No such file or directory

Already works2021-09-30Inspect
java#2407

apache/shardingsphere-elasticjob

Supports building project via JDK22

java.lang.instrument.IllegalClassFormatException: Error while instrumenting sun/util/resources/cldr/provider/CLDRLocaleDataMetaInfo with JaCoCo 0.8.10.202304240956/8ea966

Already works2024-07-27Inspect
python#2697

aws/aws-sdk-pandas

Remove README from pypi package

brazil-path: PathGenerationException: com.amazon.brazil.util.farmbuilder.SymlinkFarmBuilder$SymlinkFarmConflictException: Symlink conflict exception at lib/python3.10/sit

Already works2024-03-02Inspect
javascript#5358

axios/axios

Can't import cjs

[dev] Error [ERR_PACKAGE_PATH_NOT_EXPORTED]: Package subpath './dist/browser/axios.cjs' is not defined by "exports" in /Users/jjohn/www/grate-cms/node_modules/axios/packa

Already works2022-12-08Inspect
python#1872

boto/botocore

time to update python-dateutil again

`ERROR: botocore 1.13.9 has requirement python-dateutil<2.8.1,>=2.1; python_version >= "2.7", but you'll have python-dateutil 2.8.1 which is incompatible.`

Already works2019-11-04Inspect
python#1950

cvxpy/cvxpy

Package no longer installable from pip

ImportError: cannot import name 'Log' from 'distutils.log' (/private/var/folders/pm/97sf8nsj4vz8kvg14d9ymn3r0000gn/T/pip-build-env-kgudujw0/overlay/lib/python3.10/site-pa

Already works2022-11-21Inspect
python#394

databricks/databricks-sql-python

Unpin Thrift

No identifying execution failure has been captured.

Already works2024-06-04Inspect
java#7362

dependency-check/DependencyCheck

[BUG]: site plugin fails

[ERROR] Failed to execute goal org.apache.maven.plugins:maven-site-plugin:3.21.0:site (default-site) on project dependency-check-core: Error generating maven-dependency-p

Already works2025-01-29Inspect
java#7704

dependency-check/DependencyCheck

CVE-2025-48734

No identifying execution failure has been captured.

Already works2025-06-03Inspect
java#5281

dropwizard/dropwizard

LinkageError from Jackson Blackbird

Upon upgrading to Dropwizard 2.1.0, we encountered a LinkageError from Jackson Blackbird as described in this [issue](https://github.com/FasterXML/jackson-modules-base/is

Already works2022-05-11Inspect
javascript#218

eslint-community/eslint-plugin-promise

Support ESLint 8.x

No identifying execution failure has been captured.

Already works2021-09-04Inspect
python#203

ewels/rich-click

typing_extension requirement is too vague

I just ran into trouble trying to use this awesome lib on a computer whose `typing_extensions` was too old. It was impossible to load richclick, with error `ImportError:

Already works2024-06-13Inspect
javascript#785

fb55/entities

Source map errors

Failed to parse source map from 'G:\my_project\node_modules\entities\src\decode.ts' file: Error: ENOENT: no such file or directory, open 'G:\my_project\node_modules\entit

Already works2022-04-08Inspect
java#3844

flowable/flowable-engine

Broken OSGi bundle wiring and build

ERROR: Bundle flowable-osgi [77] Error starting reference:file:target/classes (org.osgi.framework.BundleException: Unable to resolve flowable-osgi [77](R 77.0): missing r

Already works2024-02-08Inspect
python#29

fonttools/py-zopfli

Fails to build on free-threaded Python 3.14

ValueError: `py_limited_api='cp310'` not supported. `Py_LIMITED_API` is currently incompatible with `Py_GIL_DISABLED`. See https://github.com/python/cpython/issues/111506

Already works2026-05-22Inspect
cpp#1659

ggml-org/whisper.cpp

cannot build talk.llama .

llama.obj : error LNK2019: unresolved external symbol ggml_cuda_host_malloc referenced in function "public: void __cdecl llama_buffer::resize(unsigned __int64)" (?resize@

Already works2023-12-20Inspect
python#1954

giampaolo/psutil

[M1 macOS BigSur] no suitable image found

ImportError: dlopen(/Users/mitchell/Library/Python/3.9/lib/python/site-packages/psutil/_psutil_osx.cpython-39-darwin.so, 2): no suitable image found. Did find:

Already works2021-05-26Inspect
cpp#326

google/brotli

libbrotli

No identifying execution failure has been captured.

Already works2016-03-08Inspect
java#4242

google/error-prone

Update dagger version to 2.50

This isn't really an `error-prone` issue, it's an intellij issue where it incorrectly imports dependencies from test scope (and others) from maven: https://youtrack.jetbr

Already works2024-01-05Inspect
java#1605

google/gson

Remove oss-parent pom

[FATAL] Non-resolvable parent POM for com.google.code.gson:gson-parent:2.8.7-SNAPSHOT: Could not transfer artifact org.sonatype.oss:oss-parent:pom:7 from/to google-maven-

Already works2019-11-02Inspect
cpp#785

google/sentencepiece

Linkage error

trainer_interface.obj : error LNK2001: unresolved external symbol "private: static class google::protobuf::internal::La

Already works2022-10-07Inspect
java#2582

graphhopper/graphhopper

NPM hangs

No identifying execution failure has been captured.

Already works2022-05-17Inspect
javascript#2111

grpc/grpc-node

'long' import error

The latest version 0.6.10 has error with importing 'long', and as a result I can not compile. Error log comes like this.

Already works2022-05-03Inspect
cpp#4992

harfbuzz/harfbuzz

iOS Builds

No identifying execution failure has been captured.

Already works2025-01-08Inspect
python#3239

huggingface/huggingface_hub

hf-xet Requirements missmatch

pkg_resources.VersionConflict: (huggingface-hub 0.33.1 (/.pyenv/versions/3.11.13/lib/python3.11/site-packages), Requirement.parse('huggingface-hub[hf-xet]==0.33.4'))

Already works2025-07-21Inspect
java#2565

iluwatar/java-design-patterns

Executable jar problem

- An error message `no main manifest attribute, in spatial-partition/target/spatial-partition-1.26.0-SNAPSHOT.jar` is printed

Already works2023-08-20Inspect
java#2974

iluwatar/java-design-patterns

Upgrade Guice

No identifying execution failure has been captured.

Already works2024-06-01Inspect
java#828

jacoco/jacoco

Upgrade maven-surefire-plugin

[ERROR] Failed to execute goal org.apache.maven.plugins:maven-surefire-plugin:2.20:test (default-test) on project org.jacoco.core.test: There are test failures.

Already works2019-01-11Inspect
cpp#1354

jbeder/yaml-cpp

MSVC 2022 Static Linking Problem

I used cmake to generate the yaml-cpp MSVC solution and project files. Perhaps it's user error, but I had to go and change each project to use "Multi-Threaded" instead o

Already works2025-04-08Inspect
java#1277

jtablesaw/tablesaw

Setup spotless

No identifying execution failure has been captured.

Already works2025-01-03Inspect
python#200

jupyter/nbformat

Adjectives.txt missing from wheel

FileNotFoundError: [Errno 2] No such file or directory: '/usr/local/lib/python3.8/site-packages/nbformat/corpus/adjectives.txt'

Already works2020-12-21Inspect
python#377

kislyuk/argcomplete

Typings?

No identifying execution failure has been captured.

Already works2022-10-15Inspect
javascript#3494

kulshekhar/ts-jest

Allow node@^16.10.0 instead of ^16.13.0

error ts-jest@28.0.0: The engine "node" is incompatible with this module. Expected version "^12.13.0 || ^14.15.0 || ^16.13.0 || >=17.0.0". Got "16.10.0"

Already works2022-05-03Inspect
javascript#326

lupomontero/psl

error

No identifying execution failure has been captured.

Already works2024-11-21Inspect
javascript#668

node-fetch/node-fetch

v3 Roadmap

No identifying execution failure has been captured.

Already works2019-09-07Inspect
python#464

opensearch-project/opensearch-py

[BUG] Versioning conflict urllib3

When I start my script, which uses opensearch-py 2.2.0 (same with 2.3.0) and python-keycloak (version 2.16.3), I get an error, that urllib3 2.0.4 is not found.

Already works2023-08-01Inspect
java#2727

oshi/oshi

Site failed to publish for 6.6.4 release

Error: Failed to execute goal org.apache.maven.plugins:maven-site-plugin:3.20.0:site (default-site) on project oshi-parent: Failed to create context for skin: Cannot use

Already works2024-09-16Inspect
java#3047

oshi/oshi

Site plugin fails

The job failed because the Maven changelog plugin used the git command `git whatchanged`, which is now deprecated and refused to run without the `--i-still-use-this flag`

Already works2025-12-20Inspect
python#3786

pallets/click

release 8.5.0

No identifying execution failure has been captured.

Already works2026-08-22Inspect
python#638

piskvorky/smart_open

PEP 440 Complains when using Poetry tooling

The newer version of [poetry](https://pypi.org/project/poetry/1.2.0a2/) uses the PEP 440 to validate the versions in the package, and when I tried to install the `smart_o

Already works2021-08-09Inspect
python#898

piskvorky/smart_open

tcp_keepalive error

After the smart_open version7.4 upgrade in AWS glue python shell scripts we are getting error "got unexpected keyword argument 'tcp_keepalive'.

Already works2025-10-21Inspect
javascript#292

prettier/eslint-plugin-prettier

Support ESLint 7.x

No identifying execution failure has been captured.

Already works2020-05-08Inspect
javascript#427

prettier/eslint-plugin-prettier

Support ESLint 8.x

No identifying execution failure has been captured.

Already works2021-08-23Inspect
python#227

pypa/readme_renderer

`py.typed` missing from v34.0 wheel

twine/commands/check.py:22: error: Skipping analyzing "readme_renderer.rst": module is installed, but missing library stubs or py.typed marker

Already works2022-03-11Inspect
python#1397

pytest-dev/pytest-asyncio

Raise minimum pytest version to v8.4

This should be fine for most users, because pytest 8.4 was released in 2025-06 and the backwards incompatible changes are few (mostly better error handling).

Already works2026-04-06Inspect
python#224

python-semver/python-semver

Build fails with CleanCommand super()-call

ERROR: Execution of '/yocto/build/3.0-zeus/bbb/tmp/work/cortexa8hf-neon-poky-linux-gnueabi/python3-semver/2.9.1-r0/temp/run.do_configure.28554' failed with exit code 1:

Already works2020-02-29Inspect
python#119

python-trio/trio-websocket

install fails under PyPy

wsaccel/xormask.c:2165:36: error: no member named 'curexc_traceback' in 'struct _ts'

Already works2019-06-15Inspect
python#44

python/mypy_extensions

update version

No identifying execution failure has been captured.

Already works2023-08-08Inspect
java#1183

querydsl/querydsl

querydsl-docs fails maven build

[ERROR] Failed to execute goal org.jboss.maven.plugins:maven-jdocbook-plugin:2.3.5:resources (default-resources) on project querydsl-docs: Unexpected problem: Unable to l

Already works2015-02-07Inspect
python#278

scoder/lupa

Loading C modules with pre-built wheels?

lupa.lua52.LuaError: error loading module 'chdkptp' from file '/home/lbrf/.pyenv/versions/3.9.16/lib/python3.9/site-packages/chdkptp/vendor/chdkptp/chdkptp.so':

Already works2025-02-11Inspect
python#1397

snowflakedb/snowflake-connector-python

SNOW-726880: Could not build wheels on MacOS

/private/var/folders/z2/yys4x2cs36gblb3t0n2j_ckh0000gn/T/build-env-fyhm8z5b/lib/python3.8/site-packages/pyarrow/include/arrow/type.h:1745:36: error: 'get<arrow::FieldPath

Already works2023-01-14Inspect
java#1267

sofastack/sofa-jraft

release 1.4.1

No identifying execution failure has been captured.

Already works2026-06-11Inspect
javascript#502

styled-components/polished

pkg.jsnext:main

No identifying execution failure has been captured.

Already works2020-05-04Inspect
cpp#586

taskflow/taskflow

wrong cmake path include

cmake throw an error when add_subdirectory, i check the CMakeLists.txt, here is what it shuod be

Already works2024-05-09Inspect
python#163

tobgu/pyrsistent

pryrsistent v0.15.0 fails

ERROR: Complete output from command /home/cmyers/projects/repro/ve/bin/python2 -u -c 'import setuptools, tokenize;__file__='"'"'/tmp/pip-install-NJE0aa/pyrsistent/setup.p

Already works2019-04-25Inspect
python#595

twilio/twilio-python

Relax tests requirements

I'm a Fedora packager for `python3-twilio`. I get an error during build process related with too strict version pinning for `mock` and `sphinx`. I don't think this is nec

Already works2022-03-29Inspect
python#234

ua-parser/uap-python

cut 1.0

No identifying execution failure has been captured.

Already works2024-11-23Inspect
javascript#452

yargs/yargs-parser

21.1.0 has broken typings

node_modules/@types/yargs/index.d.ts(27,10): error TS2305: Module '"yargs-parser"' has no exported member 'DetailedArguments'.

Already works2022-08-03Inspect
cpp#2313

yhirose/cpp-httplib

Issue finding zstd

The library worked on most of my machines, but strangely on one XUbuntu with version 6.18 httplib's CMakeLists could not find zstd, even though it was installed and `/usr

Already works2025-12-16Inspect
java#785

micronaut-projects/micronaut-core

Maven Central Replication / Broken BOM Deps

It would appear that some of the artifacts that are specified in the maven BOM are not replicated out to jcenter/maven/etc. I copied all the BOM deps to a POM file, remo

Not reproduced2018-10-25Inspect
python#732

python-poetry/poetry

Which pip version does poetry use?

ERROR: Project file:///workspace has a 'pyproject.toml' and its build backend is missing the 'build_editable' hook. Since it does not have a 'setup.py' nor a 'setup.cfg',

Not reproduced2018-12-11Inspect
python#1995

unslothai/unsloth

Error installing unsloth on Windows 10

ERROR: Project file:///workspace has a 'pyproject.toml' and its build backend is missing the 'build_editable' hook. Since it does not have a 'setup.py' nor a 'setup.cfg',

Not reproduced2025-03-12Inspect
javascript#1237

expressjs/express

I can't install express

npm ERR! Error: ENOENT, lstat '/usr/local/lib/node_modules/express/node_modules/connect/node_modules/qs/test/parse.js'

Not reproduced2012-07-20Inspect
javascript#506

preactjs/wmr

npm init wmr fails

`npm init wmr projectname` fails with error "Cannot find module string_decoder/"

Not reproduced2021-03-30Inspect
cpp#905

facebook/folly

build error

/home/kosh/work/folly/folly/experimental/symbolizer/Dwarf.cpp:24:10: fatal error: dwarf.h: Нет такого файла или каталога

Not reproduced2018-08-06Inspect
python#333

lm-sys/FastChat

pip install fastchat error

ERROR: Project file:///workspace has a 'pyproject.toml' and its build backend is missing the 'build_editable' hook. Since it does not have a 'setup.py' nor a 'setup.cfg',

Not reproduced2023-04-10Inspect
java#1107

openhab/openhab-distro

Problems with Maven build

Could not resolve dependencies for project org.openhab.distro:distro:feature:3.0.0-SNAPSHOT: The following artifacts could not be resolved: org.openhab.core.features.kara

Not reproduced2020-05-03Inspect
cpp#886

AcademySoftwareFoundation/openvdb

Segmentation Fault after installation on OSX

I'm building OpenVDB so I can use `pyopenvdb` on OSX Catalina. I'd like to use it in an anaconda environment (not using a system Python). After configuring, building, a

Not reproduced2020-11-27Inspect
python#61

AzureAD/azure-activedirectory-library-for-python

Issues with requests != 2.12

pkg_resources.ContextualVersionConflict: (requests 2.12.3 (/path/to/lib/python2.7/site-packages/requests-2.12.3-py2.7.egg), Requirement.parse('requests!=2.12.*,>=2.0.0'),

Not reproduced2016-12-05Inspect
python#202

AzureAD/microsoft-authentication-library-for-python

Changelog

No identifying execution failure has been captured.

Not reproduced2020-06-02Inspect
cpp#50

CloudCompare/CloudCompare

Problem building QHPR_PLUGIN_DLL

/home/jkua/projects/cloudcompare/qCC/plugins/qHPR/qHPR.cpp:31:24: fatal error: ccGLWindow.h: No such file or directory

Not reproduced2013-03-09Inspect
java#1627

DTStack/chunjun

[Bug] [mysql] 依赖问题

Caused by: org.apache.flink.table.api.ValidationException: Could not find any factory for identifier 'mysql-x' that implements 'org.apache.flink.table.factories.DynamicTa

Not reproduced2023-04-17Inspect
cpp#3048

Haivision/srt

Build error on GCC 4.8.5

/srt/haicrypt/cryspr.c:473:6: error: 'for' loop initial declarations are only allowed in C99 mode

Not reproduced2024-10-10Inspect
cpp#64

JoeyDeVries/LearnOpenGL

Master branch doesn't build on Linux

/home/joshua/Code/GitHub/LearnOpenGL/includes/glad/glad.h:26:2: error: #error OpenGL header already included, remove this include, glad already provides it

Not reproduced2017-05-18Inspect
cpp#30

LibreSprite/LibreSprite

Master fails to compile

/home/godofgrunts/temp/LibreSprite/src/allegro/include/allegro/alcompat.h:44:22: error: conflicting declaration of C function ‘fixed fadd(fixed, fixed)’

Not reproduced2018-08-12Inspect
python#320

MagicStack/uvloop

building wheel from sdist fails

error: don't know how to compile C/C++ code on platform 'posix' with '<distutils.unixccompiler.UnixCCompiler object at 0x7f054bc1fa10>' compiler

Not reproduced2020-03-09Inspect
cpp#342

Motion-Project/motion

mac build broke again

clang: error: linker command failed with exit code 1 (use -v to see invocation)

Not reproduced2017-03-06Inspect
cpp#2511

OGRECave/ogre

BULLET_XXXX_LIBRARY not found?

During the build process CMake can only find the BULLET_INCLUDE_DIRECTORY, it can't find any of the BULLET_xxxxx_LIBRARY entries. After deleting my cache, debug director

Not reproduced2022-07-06Inspect
cpp#3260

OGRECave/ogre

CMAKE static build issue

It throws an error that it can't find the file "C:/Users/8IRON/Desktop/game_cpp/built/assets/libraries/ogre-14.3.1/cmake/lib/OgreMainStatic_d.pdb", for some reason the fi

Not reproduced2024-11-16Inspect
cpp#3346

OGRECave/ogre

OgreAssimpConverter is missing rpath

./OgreAssimpConverter: error while loading shared libraries: libOgreRTShaderSystem.so.14.4: cannot open shared object file: No such file or directory

Not reproduced2025-05-23Inspect
cpp#1999

OpenAtomFoundation/pikiwidb

update rocksdb

No identifying execution failure has been captured.

Not reproduced2023-09-20Inspect
java#1833

OpenFeign/feign

Build Failure With Maven 3.8.5

[ERROR] Failed to execute goal io.sundr:sundr-maven-plugin:0.40.1:generate-bom (default) on project parent: Error building generated bom:feign-bom: Could not create React

Not reproduced2022-11-10Inspect
cpp#812

OpenXRay/xray-16

Build failed with submodules

/home/ruut/Projects/otherProjects/xray-16/Externals/submodule_check.hpp:4:2: error: #error "You probably have downloaded OpenXRay sources as ZIP archive, you can't do tha

Not reproduced2021-06-01Inspect
cpp#351

Overv/VulkanTutorial

CMake issue

No identifying execution failure has been captured.

Not reproduced2023-07-27Inspect
cpp#353

PlotJuggler/PlotJuggler

Compilation fails on OSX

$SRC_DIR/ros-noetic-plotjuggler/src/work/3rdparty/Qt-Advanced-Docking/src/linux/FloatingWidgetTitleBar.cpp:197:34: error: too many arguments to function call, expected 0,

Not reproduced2020-12-09Inspect
cpp#789

PlotJuggler/PlotJuggler

DataLoadParquet crashing

´./plotjuggler: symbol lookup error: /home/tort_di/plotjuggler_ws/build/PlotJuggler/bin/libDataLoadParquet.so: undefined symbol: _ZN7parquet25default_reader_propertiesEv

Not reproduced2023-02-13Inspect
cpp#6390

PointCloudLibrary/pcl

[cmake] Qt6 cmake errors

When building with Qt6 on Ubuntu 24.04 with ROS installed, cmake produces the following error:

Not reproduced2026-01-13Inspect
javascript#6325

Project-OSRM/osrm-backend

5.27 Release?

No identifying execution failure has been captured.

Not reproduced2022-08-23Inspect
cpp#7267

Project-OSRM/osrm-backend

osrm is not a good fetch content citizen

CMake's target_link_libraries function treats names that contain :: as target names always and will throw configure-time error if the target does not exist. Without the :

Not reproduced2025-11-03Inspect
cpp#612

PurpleI2P/i2pd

static linking fails

It fails with errors of the type `undefined reference to `dlopen'`. I found a simple fix: to move `-ldl` option in the building command line to the very end. But I have n

Not reproduced2016-08-16Inspect
cpp#877

RainerKuemmerle/g2o

Missing header in install?

/opt/workspace/install/slam/g2o/include/g2o/solvers/cholmod/cholmod_wrapper.h:33:10: fatal error: g2o_cholmod_api.h: No such file or directory

Not reproduced2025-03-19Inspect
javascript#90

Stuk/jszip

dependency error

When I run `npm install jszip`, there is an error: can't clone repository: git://github.com/imaya/zlib.js

Not reproduced2014-02-10Inspect
java#1005

TooTallNate/Java-WebSocket

Release 1.5.0

No identifying execution failure has been captured.

Not reproduced2020-04-26Inspect
java#854

TooTallNate/Java-WebSocket

Release 1.4.0

No identifying execution failure has been captured.

Not reproduced2019-02-11Inspect
java#982

TooTallNate/Java-WebSocket

Release 1.4.1

No identifying execution failure has been captured.

Not reproduced2020-02-23Inspect
cpp#8

WerWolv/ImHex

Problem building on Ubuntu 20.04

/root/parts/imhex/src/source/views/view_disassembler.cpp:221:30: error: ‘CS_ARCH_M68K’ was not declared in this scope; did you mean ‘CS_ARCH_MAX’?

Not reproduced2020-12-03Inspect
javascript#1007

acornjs/acorn

Error: MODULE_NOT_FOUND

Error: No valid exports main found for '/Users/user/Documents/JuanBot/node_modules/acorn'

Not reproduced2021-01-05Inspect
python#669

activeloopai/deeplake

[BUG]

No identifying execution failure has been captured.

Not reproduced2021-03-09Inspect
cpp#1800

alicevision/AliceVision

Errors building

error: downloading 'https://boostorg.jfrog.io/artifactory/main/release/1.84.0/source/boost_1_84_0.tar.bz2' failed

Not reproduced2025-01-09Inspect
cpp#386

alicevision/AliceVision

Can't compile under Linux Mint 18.3

All downloads and compiles without problems, expect for the link to boost ("The requested URL returned error: 404 Not Found") and the link to libpng ("HTTP/1.1 301 Moved

Not reproduced2018-04-29Inspect
java#909

apache/linkis

Compile Error

There is a useless dependency in the `linkis-engineplugin-spark` module, which causes a compilation error.

Not reproduced2021-07-25Inspect
cpp#2896

arrayfire/arrayfire

arrayfire_test compilation error

/home/wtambellini/repos/arrayfire/test/../include/af/array.h:11:26: fatal error: af/compilers.h: No such file or directory

Not reproduced2020-05-20Inspect
cpp#2956

arrayfire/arrayfire

[Build] CUDA UBUNTU 16

/home/turgut/Documents/arrayfire/src/backend/cuda/cusparse.hpp(22): error: identifier "cusparseDnVecDescr_t" is undefined

Not reproduced2020-06-30Inspect
cpp#4018

bambulab/BambuStudio

Building from source fails on Fedora 40

/home/alok/src/BambuStudio/src/clipper2/Clipper2Lib/include/clipper2/clipper.core.h:117:26: error: template-id not allowed for constructor in C++20 [-Werror=template-id-c

Not reproduced2024-05-08Inspect
cpp#921

cdcseacave/openMVS

Error building in MacOS

/Library/Developer/CommandLineTools/usr/lib/clang/14.0.0/include/xmmintrin.h:14:2: error: "This header is only meant to be used on x86 and x64 architecture"

Not reproduced2022-12-30Inspect
cpp#1435

cemu-project/Cemu

Cafe linking issue with glslang 15

/usr/src/debug/cemu/Cemu/src/Cafe/HW/Latte/Renderer/Vulkan/RendererShaderVk.cpp:314:(.text._ZN16RendererShaderVk15CompileInternalEb+0x131): undefined reference to `glslan

Not reproduced2024-12-01Inspect
javascript#4032

cheeriojs/cheerio

cheerio 1.0.0 breaks bundling of react native

Error: Unable to resolve module node:stream from /home/runner/work/thu-info-app/thu-info-app/node_modules/cheerio/dist/commonjs/index.js: node:stream could not be found w

Not reproduced2024-08-16Inspect
javascript#1177

chimurai/http-proxy-middleware

v4

No identifying execution failure has been captured.

Not reproduced2026-04-03Inspect
python#1145

confluentinc/confluent-kafka-python

No README on PyPI

No identifying execution failure has been captured.

Not reproduced2021-06-21Inspect
javascript#1110

cssnano/cssnano

[Bug] :

When running npm run build, I get the following error:

Not reproduced2021-05-19Inspect
java#238

deathmarine/Luyten

mvn build failed (501 HTTPS Required)

[ERROR] Failed to execute goal on project luyten: Could not resolve dependencies for project us.deathmarine:luyten:jar:0.5.4: Failed to collect dependencies at org.bitbuc

Not reproduced2020-02-07Inspect
java#8437

deeplearning4j/deeplearning4j

Shaded Jackson

No identifying execution failure has been captured.

Not reproduced2019-11-22Inspect
java#9138

deeplearning4j/deeplearning4j

jackson-databind vulnerability

`[ERROR] jackson-1.0.0-beta7.jar/META-INF/maven/com.fasterxml.jackson.core/jackson-databind/pom.xml: CVE-2020-25649`

Not reproduced2020-12-09Inspect
java#9297

deeplearning4j/deeplearning4j

Restore solrj-tests later

Right now, the test in the solrj module is preventing a successful build (could be due to a temp outage?), due to this error:

Not reproduced2021-05-08Inspect
python#476

facebookresearch/habitat-sim

CMake Error when installation in Colab

CMake Error: The source directory "/content/gdrive/My Drive/habitat-testing/habitat-sim/Drive/habitat-testing/habitat-sim/src" does not exist.

Not reproduced2020-02-06Inspect
javascript#141

felixge/node-dateformat

Uglify Output

No identifying execution failure has been captured.

Not reproduced2020-12-04Inspect
java#1902

google/auto

Build fails under JDK 23 and JDK 24

[ERROR] /tmp/tmp.779ZkLaA1e/auto/value/src/it/gwtserializer/src/test/java/com/google/auto/value/client/GwtSerializerTest.java:[126,18] cannot find symbol

Not reproduced2025-03-20Inspect
cpp#1125

google/benchmark

[FR] Doxygen

No identifying execution failure has been captured.

Not reproduced2021-04-26Inspect
java#1809

google/error-prone

Remove <repositories> from POMs

The error was reported on the gradle-errorprone-plugin issue tracker: https://github.com/tbroyer/gradle-errorprone-plugin/issues/47, I don't have more information (user s

Not reproduced2020-09-04Inspect
cpp#7053

google/filament

CMake generate failed

Compiler exited with error code 2: "C:\Program Files\Microsoft Visual Studio\2022\Professional\VC\Tools\MSVC\14.36.32532\bin\Hostx64\x64\cl.exe" @C:\Users\wumo\AppData\Lo

Not reproduced2023-08-09Inspect
javascript#746

grpc/grpc-node

grpc-tools install fails when running npm ci

Installing a package with `grpc-tools` as a dependency using `npm ci` fails due to `./node_modules/.bin/node-pre-gyp: No such file or directory` (on Windows, it will fail

Not reproduced2019-02-20Inspect
javascript#54

guybedford/es-module-lexer

node exports?

No identifying execution failure has been captured.

Not reproduced2020-09-22Inspect
javascript#313

iamkun/dayjs

ES6 Module Support?

my-app.ts:73 One or more components failed to load SyntaxError: The requested module '../node_modules/dayjs/dayjs.min.js' does not provide an export named 'default'

Not reproduced2018-08-24Inspect
javascript#213

import-js/eslint-import-resolver-typescript

Support for upcoming ESLint FlatConfig

SyntaxError: Named export 'CachedInputFileSystem' not found. The requested module 'enhanced-resolve' is a CommonJS module, which may not support all module.exports as nam

Not reproduced2023-02-18Inspect
javascript#2594

import-js/eslint-plugin-import

eslint 8 throwing error in CI

Error: Error while loading rule 'import/no-unused-modules': Failed to load plugin 'import' declared in '.eslintrc': Cannot find module '/home/runner/work/eslint-plugin-im

Not reproduced2022-11-12Inspect
cpp#464

infiniflow/infinity

This line does nothing

You can not set the generator in CMake. It is a read only variable. The it is specified by the -G option to CMake and once picked can not be changed. This could be change

Not reproduced2024-01-22Inspect
java#264

internetarchive/heritrix3

JDK11 support: jaxb

[ERROR] heritrix3/engine/src/main/java/org/archive/crawler/restlet/XmlMarshaller.java:[34,33] package javax.xml.bind.annotation does not exist

Not reproduced2019-08-01Inspect
java#265

internetarchive/heritrix3

JDK11 support: tools.jar

[ERROR] Failed to execute goal on project heritrix-contrib: Could not resolve dependencies for project org.archive.heritrix:heritrix-contrib:jar:3.4.0-SNAPSHOT: Could not

Not reproduced2019-08-01Inspect
java#18047

iterate-ch/cyberduck

Log4j Update

No identifying execution failure has been captured.

Not reproduced2026-05-06Inspect
java#1269

jacoco/jacoco

Cannot run a concurrent build with maven

ERROR] Failed to execute goal org.apache.maven.plugins:maven-dependency-plugin:2.2:copy (default) on project org.jacoco.agent: Unable to find artifact.: Could not find ar

Not reproduced2022-01-05Inspect
javascript#737

jaredwray/cacheable

Broken links in NPM docs

Please provide code or unit test example that will reproduce the error. If you can't provide code, please provide a detailed description of how to reproduce the error.

Not reproduced2024-07-27Inspect
javascript#809

jsx-eslint/eslint-plugin-jsx-a11y

Support ESLint 8.x

No identifying execution failure has been captured.

Not reproduced2021-08-29Inspect
python#3154

jupyter-widgets/ipywidgets

Doc build Failing

No identifying execution failure has been captured.

Not reproduced2021-03-09Inspect
python#7017

jupyter/notebook

Python 3.12: datetime.utcnow() is deprecated

ERROR tests/test_app.py::test_notebook_handler - DeprecationWarning: datetime.utcnow() is deprecated and scheduled for removal in a future version. Use timezone-aware obj

Not reproduced2023-08-21Inspect
javascript#298

kelektiv/node.bcrypt.js

Bcrypt fails to build on io.js 2.0.0

remote: ../node_modules/nan/nan_implementation_12_inl.h:181:76: error: no matching function for call to ‘v8::Signature::New(v8::Isolate*, NanIntern::Factory<v8::Si

Not reproduced2015-05-05Inspect
python#824

lexiforest/curl_cffi

Build python 3.14 Android wheels

ImportError: dlopen failed: library "libpython3.13.so" not found: needed by /data/data/com.termux/files/usr/lib/python3.14/site-packages/curl_cffi/_wrapper.abi3.so in nam

Not reproduced2026-08-08Inspect
java#6137

libgdx/libgdx

A Box2D dependent GWT module fails to build

[ERROR] Unable to find 'com/badlogic/gdx/physics/box2d/box2d-gwt.gwt.xml' on your classpath; could be a typo, or maybe you forgot to include a classpath entry for source?

Not reproduced2020-08-22Inspect
javascript#2885

markedjs/marked

Angular + Yarn pnp support

Error: Package path ./marked.min.js is not exported from package .yarn\cache\marked-npm-4.3.0-da40d83667-0db6817893.zip\node_modules\marked\ (see exports field in .yarn\c

Not reproduced2023-07-19Inspect
python#1177

mhammond/pywin32

No compatibility with pipenv

and then we do `pipenv install` on **Windows** everything will be fine. But if we do the same under **Linux** then we are in bad luck. Even though pipenv is not installin

Not reproduced2018-03-08Inspect
java#589

mybatis/spring-boot-starter

Update Tomcat to 9.0.55

The mybatis-spring-boot-sample-war is failed on JDK 17. Probably this error will fix on Tomcat 9.0.x line's latest version.

Not reproduced2021-11-20Inspect
python#4511

nasa/fprime

Not Compatible w/ Python 3.14

Attempted to run the led-blinker tutorial with python 3.14. When running the command `fprime-bootstrap project` it would complete with some build issues but the output wa

Not reproduced2025-12-05Inspect
cpp#5236

nasa/fprime

Missing DEPENDS causes strange error

If a module `CMakeLists.txt` has an empty `DEPENDS` section in the `register_fprime_library` function call, the `fprime-util generate` step will emit a bizarre error:

Not reproduced2026-06-04Inspect
cpp#9432

ocornut/imgui

Dawn examples require C++20 compiler

/home/owd/Documents/imgui/examples/example_glfw_wgpu/dawn/gen/include/dawn/webgpu_cpp.h:4328:21: error: no template named 'type_identity' in namespace 'std'; did you mean

Not reproduced2026-06-07Inspect
python#775

opencv/opencv-python

Error building on MacOS

ERROR: Cannot install numpy==1.21.2 and numpy==1.21.4 because these package versions have conflicting dependencies.

Not reproduced2023-01-11Inspect
cpp#4045

opencv/opencv_contrib

Build error in cudacodec

/home/cwlm/opencv/opencv/modules/core/include/opencv2/core/private.cuda.hpp:60:12: fatal error: cuda.h: No such file or directory

Not reproduced2025-12-07Inspect
java#2894

openzipkin/zipkin

Javadoc errors on JDK 11+

Exit code: 1 - error: --add-modules ALL-MODULE-PATH can only be used when compiling the unnamed module

Not reproduced2019-10-29Inspect
java#3159

openzipkin/zipkin

Update to surefire/failsafe 3.0.0-M5+

[ERROR] Failed to execute goal org.apache.maven.plugins:maven-failsafe-plugin:3.0.0-M5:verify (verify) on project zipkin-tests: There are test failures.

Not reproduced2020-08-03Inspect
javascript#9

prettier/eslint-plugin-prettier

CONTRIBUTING.md

No identifying execution failure has been captured.

Not reproduced2017-03-22Inspect
python#574

pymupdf/pymupdf

Please fix the linking for openSUSE

ImportError: /tmp/test_pymupdf/.venv/lib64/python3.6/site-packages/fitz/_fitz.cpython-36m-x86_64-linux-gnu.so: undefined symbol: jpeg_resync_to_restart

Not reproduced2020-07-30Inspect
java#1155

spring-cloud/spring-cloud-kubernetes

Mac M1 Support

No identifying execution failure has been captured.

Not reproduced2022-11-30Inspect
javascript#658

streamich/memfs

Add license

No identifying execution failure has been captured.

Not reproduced2021-03-31Inspect
java#4834

swagger-api/swagger-core

Bump classgraph dependency

Caused by: java.lang.NullPointerException: Cannot invoke "java.util.Collection.iterator()" because the return value of "karate.nonapi.io.github.classgraph.reflection.Refl

Not reproduced2025-01-17Inspect
javascript#524

testing-library/jest-dom

6.1.0 @adobe/css-tools crashing

SyntaxError: Named export 'parse' not found. The requested module '@adobe/css-tools' is a CommonJS module, which may not support all module.exports as named exports.

Not reproduced2023-08-23Inspect
javascript#662

testing-library/jest-dom

Cannot find package 'vitest'

Error: Cannot find package 'vitest' imported from /path/to/project/ui/node_modules/.pnpm/@testing-library+jest-dom@6.6.3/node_modules/@testing-library/jest-dom/dist/vites

Not reproduced2025-02-06Inspect
javascript#575

testing-library/react-testing-library

Drop Node 8

No identifying execution failure has been captured.

Not reproduced2020-01-21Inspect
javascript#47

tree-sitter/tree-sitter-java

Fix continuous integration build

https://github.com/tree-sitter/tree-sitter-java/pull/44 is failing but the error seems unrelated to the PR.

Not reproduced2019-06-29Inspect
cpp#1051

uxlfoundation/oneTBB

Support RISC-V

No identifying execution failure has been captured.

Not reproduced2023-03-27Inspect
cpp#542

visualboyadvance-m/visualboyadvance-m

Can't compile a Release build

ccache: error: execv of /mnt/data/dev/negativeExponent/visualboyadvance-m-git/build/gcc-ar-wrap failed: No such file or directory

Not reproduced2019-10-11Inspect
javascript#22826

vitejs/vite

vite:import-analysis fails on large files

[vite] Internal server error: Failed to parse source for import analysis because the content contains invalid JS syntax. If you are using JSX, make sure to name the file

Not reproduced2026-06-30Inspect
javascript#2711

vuejs/router

Missing vite as optional peer dependency

../node_modules/.pnpm/@vue+compiler-core@3.5.34/node_modules/@vue/compiler-core/dist/compiler-core.d.ts:3:127 - error TS2307: Cannot find module '@babel/types' or its cor

Not reproduced2026-05-13Inspect
cpp#7226

xournalpp/xournalpp

Add a QPDF version check to CMakeLists.txt

This is by itself a problem of Slackware, but CMake supports a mechanism to make identifying such issues easier. Adding a `VERSION` keyword to `find_package` makes CMake

Not reproduced2026-03-05Inspect
cpp#2176

xtensor-stack/xtensor

Single header include failure

/Users/tdegeus/miniconda3/envs/test/include/xtensor/zarray.hpp:19:10: fatal error: 'zassign.hpp' file not found

Not reproduced2020-10-05Inspect