Completer tests are failing: `ModuleNotFoundError: No module named 'langchain_core._api.__warningregistry__'`
envgap__ipython__ipython-14878
01 / FAILURE SIGNATURE
As reported upstream
FAILED tests/test_completer.py::TestCompleter::test_abspath_file_completions - ModuleNotFoundError: No module named 'langchain_core._api.__warningregistry__'
Not a benchmark task.
- In a clean container the reported failure did not reproduce, or the known fix did not make the project run.
02 / ENVIRONMENT RECIPE
- Base commit
f240204acca7815620a14e1fce1a4c4418b6aa41- Manifest
pyproject.toml- Reproduce
Awaiting issue-specific recipe- Run under trace
Awaiting a meaningful runtime command
03 / ORIGINAL ISSUE TEXT
ipython/ipython #14878 · read the original issue
Seen in both: - https://github.com/ipython/ipython/pull/14876 - https://github.com/ipython/ipython/pull/14877 but was passing in: - https://github.com/ipython/ipython/pull/14874 ``` FAILED tests/test_completer.py::TestCompleter::test_abspath_file_completions - ModuleNotFoundError: No module named 'langchain_core._api.__warningregistry__' FAILED tests/test_completer.py::TestCompleter::test_aimport_module_completer - ModuleNotFoundError: No module named 'langchain_core._api.__warningregistry__' FAILED tests/test_completer.py::TestCompleter::test_all_completions_dups - ModuleNotFoundError: No module named 'langchain_core._api.__warningregistry__' FAILED tests/test_completer.py::TestCompleter::test_back_latex_completion - ModuleNotFoundError: No module named 'langchain_core._api.__warningregistry__' FAILED tests/test_completer.py::TestCompleter::test_back_unicode_completion - ModuleNotFoundError: No module named 'langchain_core._api.__warningregistry__' FAILED tests/test_completer.py::TestCompleter::test_cell_magics - ModuleNotFoundError: No module named 'langchain_core._api.__warningregistry__' FAILED tests/test_completer.py::TestCompleter::test_class_key_completion - ModuleNotFoundError: No module named 'langchain_core._api.__warningregistry__' FAILED tests/test_completer.py::TestCompleter::test_completes_attributes_in_fstring_expressions - ModuleNotFoundError: No module named 'langchain_core._api.__warningregistry__' FAILED tests/test_completer.py::TestCompleter::test_completes_globals_as_args_of_methods - ModuleNotFoundError: No module named 'langchain_core._api.__warningregistry__' FAILED tests/test_completer.py::TestCompleter::test_completes_in_dict_expressions - ModuleNotFoundError: No module named 'langchain_core._api.__warningregistry__' FAILED tests/test_completer.py::TestCompleter::test_completion_have_signature - ModuleNotFoundError: No module named 'langchain_core._api.__warningregistry__' FAILED tests/test_completer.py::TestCompleter::test_completions_have_type - ModuleNotFoundError: No module named 'langchain_core._api.__warningregistry__' FAILED tests/test_completer.py::TestCompleter::test_custom_completion_error - ModuleNotFoundError: No module named 'langchain_core._api.__warningregistry__' FAILED tests/test_completer.py::TestCompleter::test_custom_completion_ordering - ModuleNotFoundError: No module named 'langchain_core._api.__warningregistry__' FAILED tests/test_completer.py::TestCompleter::test_dataframe_key_completion - ModuleNotFoundError: No module named 'langchain_core._api.__warningregistry__' ```
04 / LABELS
Labels from the report text only; not yet run
No supported category has been assigned.
Label rules and the text that matched
[]