← All tasks
cppavast/retdec #990Not a task: not reproduced

Compiling error with mac m1, the error looks like linux configuration is used. I don't know how to set it to mac configuration.

envgap__avast__retdec-990

01 / FAILURE SIGNATURE

As reported upstream

./configure: line 15441: syntax error near unexpected token `PROTOBUF_C,'
Not a benchmark task.
  • In a clean container the reported failure did not reproduce, or the known fix did not make the project run.

02 / ENVIRONMENT RECIPE

Base commit
18b434f02b64bfb85232525ca10a6026b5d1f54f
Manifest
CMakeLists.txt
Reproduce
Awaiting issue-specific recipe
Run under trace
Awaiting a meaningful runtime command

03 / ORIGINAL ISSUE TEXT

avast/retdec #990 · read the original issue
./configure: line 15441: syntax error near unexpected token `PROTOBUF_C,'

./configure: line 15441: `    PKG_CHECK_MODULES(PROTOBUF_C, libprotobuf-c >= 1.0.0)'

make[2]: *** [deps/yara/yara/src/yara-stamp/yara-configure-linux] Error 2

make[1]: *** [deps/yara/CMakeFiles/yara.dir/all] Error 2

make: *** [all] Error 2



![image](https://user-images.githubusercontent.com/12459826/126605738-fa1040da-ac28-450e-923d-bb7493b701c3.png)



Continue on GitHub ↗

04 / LABELS

Labels from the report text only; not yet run

No supported category has been assigned.

Label rules and the text that matched
[]