[v2.0] Compilation failed with OpenMVS_USE_CUDA
envgap__cdcseacave__openMVS-722
01 / FAILURE SIGNATURE
As reported upstream
2>D:\Program Files\Microsoft Visual Studio\2019\Community\VC\Tools\MSVC\14.29.30133\include\xutility(1481): error : deduced return type "std::_Distance_unknown" conflicts with previously deduced type "std::_Iter_diff_t<std::_String_iterator<std::_String_val<std::conditional_t<true, std::_Simple_types<char>, std::_String_iter_types<char, size_t, ptrdiff_t, char *, const char *, char &, const char &>>>>>"
Not a benchmark task.
- In a clean container the reported failure did not reproduce, or the known fix did not make the project run.
02 / ENVIRONMENT RECIPE
- Base commit
0d57474ecdd3397dde43a05a32b295b5636fb738- Manifest
CMakeLists.txt- Reproduce
Awaiting issue-specific recipe- Run under trace
Awaiting a meaningful runtime command
03 / ORIGINAL ISSUE TEXT
cdcseacave/openMVS #722 · read the original issue
OS : windows 10
VS : Visual Studio 16 2019
CUDA : 11.1
When using the OpenMVS_USE_CUDA option to compile openmvs, the compilation fails.
```
2>------ 已启动生成: 项目: MVS, 配置: Debug x64 ------
2>Compiling CUDA source file ..\..\..\openMVS\libs\MVS\PatchMatchCUDA.cu...
2>
2>D:\workspace\github\openMVS-build\libs\MVS>"C:\Program Files\NVIDIA GPU Computing Toolkit\CUDA\v11.1\bin\nvcc.exe" -gencode=arch=compute_50,code=\"compute_50,compute_50\" -gencode=arch=compute_50,code=\"sm_50,compute_50\" -gencode=arch=compute_72,code=\"compute_72,compute_72\" -gencode=arch=compute_72,code=\"sm_72,compute_72\" -gencode=arch=compute_75,code=\"compute_75,compute_75\" -gencode=arch=compute_75,code=\"sm_75,compute_75\" --use-local-env -ccbin "D:\Program Files\Microsoft Visual Studio\2019\Community\VC\Tools\MSVC\14.29.30133\bin\HostX64\x64" -x cu -I"C:\Program Files\NVIDIA GPU Computing Toolkit\CUDA\v11.1\include" -I"E:\vcpkg\installed\x64-windows\include\eigen3" -ID:\workspace\github\openMVS -I"D:\workspace\github\openMVS-build" -I"E:\vcpkg\installed\x64-windows\share\vcglib" -I"E:\vcpkg\installed\x64-windows\include" -I"E:\vcpkg\installed\x64-windows\share\cgal\..\..\include" -I"C:\Program Files\NVIDIA GPU Computing Toolkit\CUDA\v11.1\include" --keep-dir x64\Debug -maxrregcount=0 --machine 64 --compile -cudart static --expt-relaxed-constexpr -std=c++14 -Xcompiler="/EHsc -Zi -Ob0" -g -D_WINDOWS -D_SCL_SECURE_NO_DEPRECATE -D_SCL_SECURE_NO_WARNINGS -D_LIB -D_USE_OPENMP -D_USE_OPENGL -D_USE_CUDA -D_USE_BOOST -D_USE_EIGEN -D_USE_NONFREE -D_USE_FAST_FLOAT2INT -D_USE_FAST_CBRT -D_USE_SSE -D"CMAKE_INTDIR=\"Debug\"" -D_MBCS -DWIN32 -D_WINDOWS -D_CRT_SECURE_NO_DEPRECATE -D_CRT_NONSTDC_NO_DEPRECATE -D_SCL_SECURE_NO_WARNINGS -D_SCL_SECURE_NO_DEPRECATE -D_LIB -D_USE_OPENMP -D_USE_OPENGL -D_USE_CUDA -D_USE_BOOST -D_USE_EIGEN -D_USE_NONFREE -D_USE_FAST_FLOAT2INT -D_USE_FAST_CBRT -D_USE_SSE -D"CMAKE_INTDIR=\"Debug\"" -Xcompiler "/EHsc /W3 /nologo /Od /FdD:\workspace\github\openMVS-build\lib\vc16\x64\Debug\MVS.pdb /FS /Zi /RTC1 /MDd /GR" -o MVS.dir\Debug\/PatchMatchCUDA.cu.obj "D:\workspace\github\openMVS\libs\MVS\PatchMatchCUDA.cu"
2>D:\Program Files\Microsoft Visual Studio\2019\Community\VC\Tools\MSVC\14.29.30133\include\xutility(1309): error : expected a "("
2> detected during instantiation of "void std::_Adl_verify_range(const _Iter &, const _Sentinel &) [with _Iter=const char *, _Sentinel=const char *]"
2>D:\Program Files\Microsoft Visual Studio\2019\Community\VC\Tools\MSVC\14.29.30133\include\xlocale(1990): here
2>
2>D:\Program Files\Microsoft Visual Studio\2019\Community\VC\Tools\MSVC\14.29.30133\include\xutility(1309): error : expected a "("
2> detected during instantiation of "void std::_Adl_verify_range(const _Iter &, const _Sentinel &) [with _Iter=__wchar_t *, _Sentinel=__wchar_t *]"
2>D:\Program Files\Microsoft Visual Studio\2019\Community\VC\Tools\MSVC\14.29.30133\include\xlocale(1991): here
2>
2>D:\Program Files\Microsoft Visual Studio\2019\Community\VC\Tools\MSVC\14.29.30133\include\xutility(1309): error : expected a "("
2> detected during instantiation of "void std::_Adl_verify_range(const _Iter &, const _Sentinel &) [with _Iter=const __wchar_t *, _Sentinel=const __wchar_t *]"
2>D:\Program Files\Microsoft Visual Studio\2019\Community\VC\Tools\MSVC\14.29.30133\include\xlocale(2026): here
2>
2>D:\Program Files\Microsoft Visual Studio\2019\Community\VC\Tools\MSVC\14.29.30133\include\xutility(1309): error : expected a "("
2> detected during instantiation of "void std::_Adl_verify_range(const _Iter &, const _Sentinel &) [with _Iter=char *, _Sentinel=char *]"
2>D:\Program Files\Microsoft Visual Studio\2019\Community\VC\Tools\MSVC\14.29.30133\include\xlocale(2027): here
2>
2>D:\Program Files\Microsoft Visual Studio\2019\Community\VC\Tools\MSVC\14.29.30133\include\xutility(1309): error : expected a "("
2> detected during instantiation of "void std::_Adl_verify_range(const _Iter &, const _Sentinel &) [with _Iter=unsigned short *, _Sentinel=unsigned short *]"
2>D:\Program Files\Microsoft Visual Studio\2019\Community\VC\Tools\MSVC\14.29.30133\include\xlocale(2191): here
2>
2>D:\Program Files\Microsoft Visual Studio\2019\Community\VC\Tools\MSVC\14.29.30133\include\xutility(1309): error : expected a "("
2> detected during instantiation of "void std::_Adl_verify_range(const _Iter &, const _Sentinel &) [with _Iter=const unsigned short *, _Sentinel=const unsigned short *]"
2>D:\Program Files\Microsoft Visual Studio\2019\Community\VC\Tools\MSVC\14.29.30133\include\xlocale(2227): here
2>
2>D:\Program Files\Microsoft Visual Studio\2019\Community\VC\Tools\MSVC\14.29.30133\include\xutility(1309): error : expected a "("
2> detected during instantiation of "void std::_Adl_verify_range(const _Iter &, const _Sentinel &) [with _Iter=char *, _Sentinel=const char *]"
2>D:\Program Files\Microsoft Visual Studio\2019\Community\VC\Tools\MSVC\14.29.30133\include\xlocale(2772): here
2>
2>D:\Program Files\Microsoft Visual Studio\2019\Community\VC\Tools\MSVC\14.29.30133\include\xutility(1309): error : expected a "("
2> detected during instantiation of "void std::_Adl_verify_range(const _Iter &, const _Sentinel &) [with _Iter=__wchar_t *, _Sentinel=const __wchar_t *]"
2>D:\Program Files\Microsoft Visual Studio\2019\Community\VC\Tools\MSVC\14.29.30133\include\xlocale(2954): here
2>
2>D:\Program Files\Microsoft Visual Studio\2019\Community\VC\Tools\MSVC\14.29.30133\include\xutility(1309): error : expected a "("
2> detected during instantiation of "void std::_Adl_verify_range(const _Iter &, const _Sentinel &) [with _Iter=unsigned short *, _Sentinel=const unsigned short *]"
2>D:\Program Files\Microsoft Visual Studio\2019\Community\VC\Tools\MSVC\14.29.30133\include\xlocale(3157): here
2>
2>host_defines.h is an internal header file and must not be used directly. This file will be removed in a future CUDA release. Please use cuda_runtime_api.h or cuda_runtime.h instead.
2>E:\vcpkg\installed\x64-windows\include\eigen3\Eigen\src/Core/util/XprHelper.h(108): warning : __host__ annotation is ignored on a function("no_assignment_operator") that is explicitly defaulted on its first declaration
2>
2>E:\vcpkg\installed\x64-windows\include\eigen3\Eigen\src/Core/util/XprHelper.h(108): warning : __device__ annotation is ignored on a function("no_assignment_operator") that is explicitly defaulted on its first declaration
2>
2>E:\vcpkg\installed\x64-windows\include\eigen3\Eigen\src/Core/util/XprHelper.h(109): warning : __host__ annotation is ignored on a function("no_assignment_operator") that is explicitly defaulted on its first declaration
2>
2>E:\vcpkg\installed\x64-windows\include\eigen3\Eigen\src/Core/util/XprHelper.h(109): warning : __device__ annotation is ignored on a function("no_assignment_operator") that is explicitly defaulted on its first declaration
2>
2>E:\vcpkg\installed\x64-windows\include\eigen3\Eigen\src/Core/util/XprHelper.h(109): warning : __host__ annotation is ignored on a function("~no_assignment_operator") that is explicitly defaulted on its first declaration
2>
2>E:\vcpkg\installed\x64-windows\include\eigen3\Eigen\src/Core/util/XprHelper.h(109): warning : __device__ annotation is ignored on a function("~no_assignment_operator") that is explicitly defaulted on its first declaration
2>
2>E:\vcpkg\installed\x64-windows\include\eigen3\Eigen\src/Core/util/Memory.h(73): warning : ignoring return value from routine declared with "nodiscard" attribute
2>
2>E:\vcpkg\installed\x64-windows\include\eigen3\Eigen\src/Core/DenseBase.h(590): warning : __host__ annotation is ignored on a function("DenseBase") that is explicitly defaulted on its first declaration
2>
2>E:\vcpkg\installed\x64-windows\include\eigen3\Eigen\src/Core/DenseBase.h(590): warning : __device__ annotation is ignored on a function("DenseBase") that is explicitly defaulted on its first declaration
2>
2>E:\vcpkg\installed\x64-windows\include\eigen3\Eigen\src/Core/MatrixBase.h(467): warning : __host__ annotation is ignored on a function("MatrixBase") that is explicitly defaulted on its first declaration
2>
2>E:\vcpkg\installed\x64-windows\include\eigen3\Eigen\src/Core/MatrixBase.h(467): warning : __device__ annotation is ignored on a function("MatrixBase") that is explicitly defaulted on its first declaration
2>
2>E:\vcpkg\installed\x64-windows\include\eigen3\Eigen\src/Core/MatrixBase.h(468): warning : __host__ annotation is ignored on a function("MatrixBase") that is explicitly defaulted on its first declaration
2>
2>E:\vcpkg\installed\x64-windows\include\eigen3\Eigen\src/Core/MatrixBase.h(468): warning : __device__ annotation is ignored on a function("MatrixBase") that is explicitly defaulted on its first declaration
2>
2>E:\vcpkg\installed\x64-windows\include\eigen3\Eigen\src/Core/MatrixBase.h(468): warning : __host__ annotation is ignored on a function("~MatrixBase") that is explicitly defaulted on its first declaration
2>
2>E:\vcpkg\installed\x64-windows\include\eigen3\Eigen\src/Core/MatrixBase.h(468): warning : __device__ annotation is ignored on a function("~MatrixBase") that is explicitly defaulted on its first declaration
2>
2>E:\vcpkg\installed\x64-windows\include\eigen3\Eigen\src/Core/ArrayBase.h(156): warning : __host__ annotation is ignored on a function("ArrayBase") that is explicitly defaulted on its first declaration
2>
2>E:\vcpkg\installed\x64-windows\include\eigen3\Eigen\src/Core/ArrayBase.h(156): warning : __device__ annotation is ignored on a function("ArrayBase") that is explicitly defaulted on its first declaration
2>
2>E:\vcpkg\installed\x64-windows\include\eigen3\Eigen\src/Core/ArrayBase.h(157): warning : __host__ annotation is ignored on a function("ArrayBase") that is explicitly defaulted on its first declaration
2>
2>E:\vcpkg\installed\x64-windows\include\eigen3\Eigen\src/Core/ArrayBase.h(157): warning : __device__ annotation is ignored on a function("ArrayBase") that is explicitly defaulted on its first declaration
2>
2>E:\vcpkg\installed\x64-windows\include\eigen3\Eigen\src/Core/ArrayBase.h(157): warning : __host__ annotation is ignored on a function("~ArrayBase") that is explicitly defaulted on its first declaration
2>
2>E:\vcpkg\installed\x64-windows\include\eigen3\Eigen\src/Core/ArrayBase.h(157): warning : __device__ annotation is ignored on a function("~ArrayBase") that is explicitly defaulted on its first declaration
2>
2>E:\vcpkg\installed\x64-windows\include\eigen3\Eigen\src/Core/CwiseUnaryView.h(70): warning : __host__ annotation is ignored on a function("CwiseUnaryView") that is explicitly defaulted on its first declaration
2>
2>E:\vcpkg\installed\x64-windows\include\eigen3\Eigen\src/Core/CwiseUnaryView.h(70): warning : __device__ annotation is ignored on a function("CwiseUnaryView") that is explicitly defaulted on its first declaration
2>
2>E:\vcpkg\installed\x64-windows\include\eigen3\Eigen\src/Core/CwiseUnaryView.h(110): warning : __host__ annotation is ignored on a function("CwiseUnaryViewImpl") that is explicitly defaulted on its first declaration
2>
2>E:\vcpkg\installed\x64-windows\include\eigen3\Eigen\src/Core/CwiseUnaryView.h(110): warning : __device__ annotation is ignored on a function("CwiseUnaryViewImpl") that is explicitly defaulted on its first declaration
2>
2>E:\vcpkg\installed\x64-windows\include\eigen3\Eigen\src/Core/CwiseUnaryView.h(125): warning : __host__ annotation is ignored on a function("CwiseUnaryViewImpl") that is explicitly defaulted on its first declaration
2>
2>E:\vcpkg\installed\x64-windows\include\eigen3\Eigen\src/Core/CwiseUnaryView.h(125): warning : __device__ annotation is ignored on a function("CwiseUnaryViewImpl") that is explicitly defaulted on its first declaration
2>
2>E:\vcpkg\installed\x64-windows\include\eigen3\Eigen\src/Core/CwiseUnaryView.h(125): warning : __host__ annotation is ignored on a function("~CwiseUnaryViewImpl") that is explicitly defaulted on its first declaration
2>
2>E:\vcpkg\installed\x64-windows\include\eigen3\Eigen\src/Core/CwiseUnaryView.h(125): warning : __device__ annotation is ignored on a function("~CwiseUnaryViewImpl") that is explicitly defaulted on its first declaration
2>
2>E:\vcpkg\installed\x64-windows\include\eigen3\Eigen\src/Core/MapBase.h(185): warning : __host__ annotation is ignored on a function("MapBase") that is explicitly defaulted on its first declaration
2>
2>E:\vcpkg\installed\x64-windows\include\eigen3\Eigen\src/Core/MapBase.h(185): warning : __device__ annotation is ignored on a function("MapBase") that is explicitly defaulted on its first declaration
2>
2>E:\vcpkg\installed\x64-windows\include\eigen3\Eigen\src/Core/MapBase.h(186): warning : __host__ annotation is ignored on a function("MapBase") that is explicitly defaulted on its first declaration
2>
2>E:\vcpkg\installed\x64-windows\include\eigen3\Eigen\src/Core/MapBase.h(186): warning : __device__ annotation is ignored on a function("MapBase") that is explicitly defaulted on its first declaration
2>
2>E:\vcpkg\installed\x64-windows\include\eigen3\Eigen\src/Core/MapBase.h(186): warning : __host__ annotation is ignored on a function("~MapBase") that is explicitly defaulted on its first declaration
2>
2>E:\vcpkg\installed\x64-windows\include\eigen3\Eigen\src/Core/MapBase.h(186): warning : __device__ annotation is ignored on a function("~MapBase") that is explicitly defaulted on its first declaration
2>
2>E:\vcpkg\installed\x64-windows\include\eigen3\Eigen\src/Core/MapBase.h(300): warning : __host__ annotation is ignored on a function("MapBase") that is explicitly defaulted on its first declaration
2>
2>E:\vcpkg\installed\x64-windows\include\eigen3\Eigen\src/Core/MapBase.h(300): warning : __device__ annotation is ignored on a function("MapBase") that is explicitly defaulted on its first declaration
2>
2>E:\vcpkg\installed\x64-windows\include\eigen3\Eigen\src/Core/MapBase.h(301): warning : __host__ annotation is ignored on a function("MapBase") that is explicitly defaulted on its first declaration
2>
2>E:\vcpkg\installed\x64-windows\include\eigen3\Eigen\src/Core/MapBase.h(301): warning : __device__ annotation is ignored on a function("MapBase") that is explicitly defaulted on its first declaration
2>
2>E:\vcpkg\installed\x64-windows\include\eigen3\Eigen\src/Core/MapBase.h(301): warning : __host__ annotation is ignored on a function("~MapBase") that is explicitly defaulted on its first declaration
2>
2>E:\vcpkg\installed\x64-windows\include\eigen3\Eigen\src/Core/MapBase.h(301): warning : __device__ annotation is ignored on a function("~MapBase") that is explicitly defaulted on its first declaration
2>
2>E:\vcpkg\installed\x64-windows\include\eigen3\Eigen\src/Core/Map.h(162): warning : __host__ annotation is ignored on a function("Map") that is explicitly defaulted on its first declaration
2>
2>E:\vcpkg\installed\x64-windows\include\eigen3\Eigen\src/Core/Map.h(162): warning : __device__ annotation is ignored on a function("Map") that is explicitly defaulted on its first declaration
2>
2>E:\vcpkg\installed\x64-windows\include\eigen3\Eigen\src/Core/Ref.h(90): warning : __host__ annotation is ignored on a function("RefBase") that is explicitly defaulted on its first declaration
2>
2>E:\vcpkg\installed\x64-windows\include\eigen3\Eigen\src/Core/Ref.h(90): warning : __device__ annotation is ignored on a function("RefBase") that is explicitly defaulted on its first declaration
2>
2>E:\vcpkg\installed\x64-windows\include\eigen3\Eigen\src/Core/Ref.h(230): warning : __host__ annotation is ignored on a function("Ref") that is explicitly defaulted on its first declaration
2>
2>E:\vcpkg\installed\x64-windows\include\eigen3\Eigen\src/Core/Ref.h(230): warning : __device__ annotation is ignored on a function("Ref") that is explicitly defaulted on its first declaration
2>
2>E:\vcpkg\installed\x64-windows\include\eigen3\Eigen\src/Core/Block.h(111): warning : __host__ annotation is ignored on a function("Block") that is explicitly defaulted on its first declaration
2>
2>E:\vcpkg\installed\x64-windows\include\eigen3\Eigen\src/Core/Block.h(111): warning : __device__ annotation is ignored on a function("Block") that is explicitly defaulted on its first declaration
2>
2>E:\vcpkg\installed\x64-windows\include\eigen3\Eigen\src/Core/Block.h(161): warning : __host__ annotation is ignored on a function("BlockImpl") that is explicitly defaulted on its first declaration
2>
2>E:\vcpkg\installed\x64-windows\include\eigen3\Eigen\src/Core/Block.h(161): warning : __device__ annotation is ignored on a function("BlockImpl") that is explicitly defaulted on its first declaration
2>
2>E:\vcpkg\installed\x64-windows\include\eigen3\Eigen\src/Core/Block.h(181): warning : __host__ annotation is ignored on a function("BlockImpl_dense") that is explicitly defaulted on its first declaration
2>
2>E:\vcpkg\installed\x64-windows\include\eigen3\Eigen\src/Core/Block.h(181): warning : __device__ annotation is ignored on a function("BlockImpl_dense") that is explicitly defaulted on its first declaration
2>
2>E:\vcpkg\installed\x64-windows\include\eigen3\Eigen\src/Core/Block.h(341): warning : __host__ annotation is ignored on a function("BlockImpl_dense") that is explicitly defaulted on its first declaration
2>
2>E:\vcpkg\installed\x64-windows\include\eigen3\Eigen\src/Core/Block.h(341): warning : __device__ annotation is ignored on a function("BlockImpl_dense") that is explicitly defaulted on its first declaration
2>
2>E:\vcpkg\installed\x64-windows\include\eigen3\Eigen\src/Core/Transpose.h(66): warning : __host__ annotation is ignored on a function("Transpose") that is explicitly defaulted on its first declaration
2>
2>E:\vcpkg\installed\x64-windows\include\eigen3\Eigen\src/Core/Transpose.h(66): warning : __device__ annotation is ignored on a function("Transpose") that is explicitly defaulted on its first declaration
2>
2>E:\vcpkg\installed\x64-windows\include\eigen3\Eigen\src/Core/Transpose.h(123): warning : __host__ annotation is ignored on a function("TransposeImpl") that is explicitly defaulted on its first declaration
2>
2>E:\vcpkg\installed\x64-windows\include\eigen3\Eigen\src/Core/Transpose.h(123): warning : __device__ annotation is ignored on a function("TransposeImpl") that is explicitly defaulted on its first declaration
2>
2>E:\vcpkg\installed\x64-windows\include\eigen3\Eigen\src/Core/Transpose.h(150): warning : __host__ annotation is ignored on a function("TransposeImpl") that is explicitly defaulted on its first declaration
2>
2>E:\vcpkg\installed\x64-windows\include\eigen3\Eigen\src/Core/Transpose.h(150): warning : __device__ annotation is ignored on a function("TransposeImpl") that is explicitly defaulted on its first declaration
2>
2>E:\vcpkg\installed\x64-windows\include\eigen3\Eigen\src/Core/Transpose.h(150): warning : __host__ annotation is ignored on a function("~TransposeImpl") that is explicitly defaulted on its first declaration
2>
2>E:\vcpkg\installed\x64-windows\include\eigen3\Eigen\src/Core/Transpose.h(150): warning : __device__ annotation is ignored on a function("~TransposeImpl") that is explicitly defaulted on its first declaration
2>
2>E:\vcpkg\installed\x64-windows\include\eigen3\Eigen\src/Core/Diagonal.h(78): warning : __host__ annotation is ignored on a function("Diagonal") that is explicitly defaulted on its first declaration
2>
2>E:\vcpkg\installed\x64-windows\include\eigen3\Eigen\src/Core/Diagonal.h(78): warning : __device__ annotation is ignored on a function("Diagonal") that is explicitly defaulted on its first declaration
2>
2>E:\vcpkg\installed\x64-windows\include\eigen3\Eigen\src/Core/TriangularMatrix.h(220): warning : __host__ annotation is ignored on a function("TriangularView") that is explicitly defaulted on its first declaration
2>
2>E:\vcpkg\installed\x64-windows\include\eigen3\Eigen\src/Core/TriangularMatrix.h(220): warning : __device__ annotation is ignored on a function("TriangularView") that is explicitly defaulted on its first declaration
2>
2>E:\vcpkg\installed\x64-windows\include\eigen3\Eigen\src/Core/TriangularMatrix.h(546): warning : __host__ annotation is ignored on a function("TriangularViewImpl") that is explicitly defaulted on its first declaration
2>
2>E:\vcpkg\installed\x64-windows\include\eigen3\Eigen\src/Core/TriangularMatrix.h(546): warning : __device__ annotation is ignored on a function("TriangularViewImpl") that is explicitly defaulted on its first declaration
2>
2>E:\vcpkg\installed\x64-windows\include\eigen3\Eigen\src/Core/TriangularMatrix.h(547): warning : __host__ annotation is ignored on a function("TriangularViewImpl") that is explicitly defaulted on its first declaration
2>
2>E:\vcpkg\installed\x64-windows\include\eigen3\Eigen\src/Core/TriangularMatrix.h(547): warning : __device__ annotation is ignored on a function("TriangularViewImpl") that is explicitly defaulted on its first declaration
2>
2>E:\vcpkg\installed\x64-windows\include\eigen3\Eigen\src/Core/TriangularMatrix.h(547): warning : __host__ annotation is ignored on a function("~TriangularViewImpl") that is explicitly defaulted on its first declaration
2>
2>E:\vcpkg\installed\x64-windows\include\eigen3\Eigen\src/Core/TriangularMatrix.h(547): warning : __device__ annotation is ignored on a function("~TriangularViewImpl") that is explicitly defaulted on its first declaration
2>
2>E:\vcpkg\installed\x64-windows\include\eigen3\Eigen\src/Core/Reverse.h(90): warning : __host__ annotation is ignored on a function("Reverse") that is explicitly defaulted on its first declaration
2>
2>E:\vcpkg\installed\x64-windows\include\eigen3\Eigen\src/Core/Reverse.h(90): warning : __device__ annotation is ignored on a function("Reverse") that is explicitly defaulted on its first declaration
2>
2>E:\vcpkg\installed\x64-windows\include\eigen3\Eigen\src/Core/ArrayWrapper.h(47): warning : __host__ annotation is ignored on a function("ArrayWrapper") that is explicitly defaulted on its first declaration
2>
2>E:\vcpkg\installed\x64-windows\include\eigen3\Eigen\src/Core/ArrayWrapper.h(47): warning : __device__ annotation is ignored on a function("ArrayWrapper") that is explicitly defaulted on its first declaration
2>
2>E:\vcpkg\installed\x64-windows\include\eigen3\Eigen\src/Core/ArrayWrapper.h(94): warning : __declspec attributes ignored
2>
2>E:\vcpkg\installed\x64-windows\include\eigen3\Eigen\src/Core/ArrayWrapper.h(145): warning : __host__ annotation is ignored on a function("MatrixWrapper") that is explicitly defaulted on its first declaration
2>
2>E:\vcpkg\installed\x64-windows\include\eigen3\Eigen\src/Core/ArrayWrapper.h(145): warning : __device__ annotation is ignored on a function("MatrixWrapper") that is explicitly defaulted on its first declaration
2>
2>E:\vcpkg\installed\x64-windows\include\eigen3\Eigen\src/LU/InverseImpl.h(336): warning : a __host__ function("Eigen::MatrixBase<Derived>::inverse") redeclared with __host__ __device__, hence treated as a __host__ __device__ function
2>
2>E:\vcpkg\installed\x64-windows\include\eigen3\Eigen\src/Geometry/Quaternion.h(202): warning : __host__ annotation is ignored on a function("QuaternionBase") that is explicitly defaulted on its first declaration
2>
2>E:\vcpkg\installed\x64-windows\include\eigen3\Eigen\src/Geometry/Quaternion.h(202): warning : __device__ annotation is ignored on a function("QuaternionBase") that is explicitly defaulted on its first declaration
2>
2>E:\vcpkg\installed\x64-windows\include\eigen3\Eigen\src/Geometry/Quaternion.h(203): warning : __host__ annotation is ignored on a function("QuaternionBase") that is explicitly defaulted on its first declaration
2>
2>E:\vcpkg\installed\x64-windows\include\eigen3\Eigen\src/Geometry/Quaternion.h(203): warning : __device__ annotation is ignored on a function("QuaternionBase") that is explicitly defaulted on its first declaration
2>
2>E:\vcpkg\installed\x64-windows\include\eigen3\Eigen\src/Geometry/Quaternion.h(203): warning : __host__ annotation is ignored on a function("~QuaternionBase") that is explicitly defaulted on its first declaration
2>
2>E:\vcpkg\installed\x64-windows\include\eigen3\Eigen\src/Geometry/Quaternion.h(203): warning : __device__ annotation is ignored on a function("~QuaternionBase") that is explicitly defaulted on its first declaration
2>
2>E:\vcpkg\installed\x64-windows\include\eigen3\Eigen\src/Geometry/Quaternion.h(258): warning : __host__ annotation is ignored on a function("Quaternion") that is explicitly defaulted on its first declaration
2>
2>E:\vcpkg\installed\x64-windows\include\eigen3\Eigen\src/Geometry/Quaternion.h(258): warning : __device__ annotation is ignored on a function("Quaternion") that is explicitly defaulted on its first declaration
2>
2>E:\vcpkg\installed\x64-windows\include\eigen3\Eigen\src/Geometry/Quaternion.h(374): warning : __host__ annotation is ignored on a function("Map") that is explicitly defaulted on its first declaration
2>
2>E:\vcpkg\installed\x64-windows\include\eigen3\Eigen\src/Geometry/Quaternion.h(374): warning : __device__ annotation is ignored on a function("Map") that is explicitly defaulted on its first declaration
2>
2>E:\vcpkg\installed\x64-windows\include\eigen3\Eigen\src/Geometry/Quaternion.h(411): warning : __host__ annotation is ignored on a function("Map") that is explicitly defaulted on its first declaration
2>
2>E:\vcpkg\installed\x64-windows\include\eigen3\Eigen\src/Geometry/Quaternion.h(411): warning : __device__ annotation is ignored on a function("Map") that is explicitly defaulted on its first declaration
2>
2>D:\Program Files\Microsoft Visual Studio\2019\Community\VC\Tools\MSVC\14.29.30133\include\xmemory(62): error : expected a "("
2> detected during:
2> instantiation of "size_t std::_Get_size_of_n<_Ty_size>(size_t) [with _Ty_size=16ULL]"
2>(839): here
2> instantiation of "_Ty *std::allocator<_Ty>::allocate(size_t) [with _Ty=std::_Container_proxy]"
2>(1341): here
2> instantiation of "std::_Container_proxy_ptr12<_Alloc>::_Container_proxy_ptr12(_Alloc &, std::_Container_base12 &) [with _Alloc=std::_Rebind_alloc_t<std::_Rebind_alloc_t<std::allocator<char>, char>, std::_Container_proxy>]"
2>D:\Program Files\Microsoft Visual Studio\2019\Community\VC\Tools\MSVC\14.29.30133\include\xstring(2453): here
2> instantiation of "std::basic_string<_Elem, _Traits, _Alloc>::basic_string(const std::basic_string<_Elem, _Traits, _Alloc> &) [with _Elem=char, _Traits=std::char_traits<char>, _Alloc=std::allocator<char>]"
2>D:\Program Files\Microsoft Visual Studio\2019\Community\VC\Tools\MSVC\14.29.30133\include\system_error(453): here
2>
2>D:\Program Files\Microsoft Visual Studio\2019\Community\VC\Tools\MSVC\14.29.30133\include\xutility(131): error : expected a "("
2> detected during:
2> instantiation of "void *std::_Voidify_iter(_Iter) [with _Iter=std::_Container_proxy *]"
2>(158): here
2> instantiation of "void std::_Construct_in_place(_Ty &, _Types &&...) [with _Ty=std::_Container_proxy, _Types=<std::_Container_base12 *>]"
2>D:\Program Files\Microsoft Visual Studio\2019\Community\VC\Tools\MSVC\14.29.30133\include\xmemory(1342): here
2> instantiation of "std::_Container_proxy_ptr12<_Alloc>::_Container_proxy_ptr12(_Alloc &, std::_Container_base12 &) [with _Alloc=std::_Rebind_alloc_t<std::_Rebind_alloc_t<std::allocator<char>, char>, std::_Container_proxy>]"
2>D:\Program Files\Microsoft Visual Studio\2019\Community\VC\Tools\MSVC\14.29.30133\include\xstring(2453): here
2> instantiation of "std::basic_string<_Elem, _Traits, _Alloc>::basic_string(const std::basic_string<_Elem, _Traits, _Alloc> &) [with _Elem=char, _Traits=std::char_traits<char>, _Alloc=std::allocator<char>]"
2>D:\Program Files\Microsoft Visual Studio\2019\Community\VC\Tools\MSVC\14.29.30133\include\system_error(453): here
2>
2>D:\Program Files\Microsoft Visual Studio\2019\Community\VC\Tools\MSVC\14.29.30133\include\xmemory(988): error : expected a "("
2> detected during:
2> instantiation of "void std::_Deallocate_plain(_Alloc &, _Alloc::value_type *) [with _Alloc=std::_Rebind_alloc_t<std::_Rebind_alloc_t<std::allocator<char>, char>, std::_Container_proxy>]"
2>(1002): here
2> instantiation of "void std::_Delete_plain_internal(_Alloc &, _Alloc::value_type *) [with _Alloc=std::_Rebind_alloc_t<std::_Rebind_alloc_t<std::allocator<char>, char>, std::_Container_proxy>]"
2>(1355): here
2> instantiation of "std::_Container_proxy_ptr12<_Alloc>::~_Container_proxy_ptr12() [with _Alloc=std::_Rebind_alloc_t<std::_Rebind_alloc_t<std::allocator<char>, char>, std::_Container_proxy>]"
2>D:\Program Files\Microsoft Visual Studio\2019\Community\VC\Tools\MSVC\14.29.30133\include\xstring(2453): here
2> instantiation of "std::basic_string<_Elem, _Traits, _Alloc>::basic_string(const std::basic_string<_Elem, _Traits, _Alloc> &) [with _Elem=char, _Traits=std::char_traits<char>, _Alloc=std::allocator<char>]"
2>D:\Program Files\Microsoft Visual Studio\2019\Community\VC\Tools\MSVC\14.29.30133\include\system_error(453): here
2>
2>D:\Program Files\Microsoft Visual Studio\2019\Community\VC\Tools\MSVC\14.29.30133\include\xmemory(62): error : expected a "("
2> detected during:
2> instantiation of "size_t std::_Get_size_of_n<_Ty_size>(size_t) [with _Ty_size=1ULL]"
2>(839): here
2> instantiation of "_Ty *std::allocator<_Ty>::allocate(size_t) [with _Ty=char]"
2>D:\Program Files\Microsoft Visual Studio\2019\Community\VC\Tools\MSVC\14.29.30133\include\xstring(2942): here
2> instantiation of "void std::basic_string<_Elem, _Traits, _Alloc>::_Construct_lv_contents(const std::basic_string<_Elem, _Traits, _Alloc> &) [with _Elem=char, _Traits=std::char_traits<char>, _Alloc=std::allocator<char>]"
2>D:\Program Files\Microsoft Visual Studio\2019\Community\VC\Tools\MSVC\14.29.30133\include\xstring(2454): here
2> instantiation of "std::basic_string<_Elem, _Traits, _Alloc>::basic_string(const std::basic_string<_Elem, _Traits, _Alloc> &) [with _Elem=char, _Traits=std::char_traits<char>, _Alloc=std::allocator<char>]"
2>D:\Program Files\Microsoft Visual Studio\2019\Community\VC\Tools\MSVC\14.29.30133\include\system_error(453): here
2>
2>D:\Program Files\Microsoft Visual Studio\2019\Community\VC\Tools\MSVC\14.29.30133\include\xutility(131): error : expected a "("
2> detected during:
2> instantiation of "void *std::_Voidify_iter(_Iter) [with _Iter=char **]"
2>(158): here
2> instantiation of "void std::_Construct_in_place(_Ty &, _Types &&...) [with _Ty=char *, _Types=<char *const &>]"
2>D:\Program Files\Microsoft Visual Studio\2019\Community\VC\Tools\MSVC\14.29.30133\include\xstring(2943): here
2> instantiation of "void std::basic_string<_Elem, _Traits, _Alloc>::_Construct_lv_contents(const std::basic_string<_Elem, _Traits, _Alloc> &) [with _Elem=char, _Traits=std::char_traits<char>, _Alloc=std::allocator<char>]"
2>D:\Program Files\Microsoft Visual Studio\2019\Community\VC\Tools\MSVC\14.29.30133\include\xstring(2454): here
2> instantiation of "std::basic_string<_Elem, _Traits, _Alloc>::basic_string(const std::basic_string<_Elem, _Traits, _Alloc> &) [with _Elem=char, _Traits=std::char_traits<char>, _Alloc=std::allocator<char>]"
2>D:\Program Files\Microsoft Visual Studio\2019\Community\VC\Tools\MSVC\14.29.30133\include\system_error(453): here
2>
2>D:\Program Files\Microsoft Visual Studio\2019\Community\VC\Tools\MSVC\14.29.30133\include\xstring(2881): error : expected a "("
2> detected during:
2> instantiation of "void std::basic_string<_Elem, _Traits, _Alloc>::_Take_contents(std::basic_string<_Elem, _Traits, _Alloc> &) [with _Elem=char, _Traits=std::char_traits<char>, _Alloc=std::allocator<char>]"
2>(2607): here
2> instantiation of "std::basic_string<_Elem, _Traits, _Alloc>::basic_string(std::basic_string<_Elem, _Traits, _Alloc> &&) [with _Elem=char, _Traits=std::char_traits<char>, _Alloc=std::allocator<char>]"
2>D:\Program Files\Microsoft Visual Studio\2019\Community\VC\Tools\MSVC\14.29.30133\include\string(541): here
2>
2>D:\Program Files\Microsoft Visual Studio\2019\Community\VC\Tools\MSVC\14.29.30133\include\xmemory(308): error : expected a "("
2> detected during:
2> instantiation of "void std::_Destroy_in_place(_Ty &) [with _Ty=char *]"
2>D:\Program Files\Microsoft Visual Studio\2019\Community\VC\Tools\MSVC\14.29.30133\include\xstring(4621): here
2> instantiation of "void std::basic_string<_Elem, _Traits, _Alloc>::_Tidy_deallocate() [with _Elem=char, _Traits=std::char_traits<char>, _Alloc=std::allocator<char>]"
2>D:\Program Files\Microsoft Visual Studio\2019\Community\VC\Tools\MSVC\14.29.30133\include\xstring(3003): here
2> instantiation of "std::basic_string<_Elem, _Traits, _Alloc>::~basic_string() [with _Elem=char, _Traits=std::char_traits<char>, _Alloc=std::allocator<char>]"
2>D:\Program Files\Microsoft Visual Studio\2019\Community\VC\Tools\MSVC\14.29.30133\include\string(539): here
2>
2>D:\Program Files\Microsoft Visual Studio\2019\Community\VC\Tools\MSVC\14.29.30133\include\xmemory(959): error : expected a "("
2> detected during:
2> instantiation of "void std::_Destroy_range(_NoThrowFwdIt, _NoThrowSentinel) [with _NoThrowFwdIt=char *, _NoThrowSentinel=char *]"
2>(309): here
2> instantiation of "void std::_Destroy_in_place(_Ty &) [with _Ty=char *]"
2>D:\Program Files\Microsoft Visual Studio\2019\Community\VC\Tools\MSVC\14.29.30133\include\xstring(4621): here
2> instantiation of "void std::basic_string<_Elem, _Traits, _Alloc>::_Tidy_deallocate() [with _Elem=char, _Traits=std::char_traits<char>, _Alloc=std::allocator<char>]"
2>D:\Program Files\Microsoft Visual Studio\2019\Community\VC\Tools\MSVC\14.29.30133\include\xstring(3003): here
2> instantiation of "std::basic_string<_Elem, _Traits, _Alloc>::~basic_string() [with _Elem=char, _Traits=std::char_traits<char>, _Alloc=std::allocator<char>]"
2>D:\Program Files\Microsoft Visual Studio\2019\Community\VC\Tools\MSVC\14.29.30133\include\string(539): here
2>
2>D:\Program Files\Microsoft Visual Studio\2019\Community\VC\Tools\MSVC\14.29.30133\include\xmemory(308): error : expected a "("
2> detected during:
2> instantiation of "void std::_Destroy_in_place(_Ty &) [with _Ty=char]"
2>(961): here
2> instantiation of "void std::_Destroy_range(_NoThrowFwdIt, _NoThrowSentinel) [with _NoThrowFwdIt=char *, _NoThrowSentinel=char *]"
2>(309): here
2> instantiation of "void std::_Destroy_in_place(_Ty &) [with _Ty=char *]"
2>D:\Program Files\Microsoft Visual Studio\2019\Community\VC\Tools\MSVC\14.29.30133\include\xstring(4621): here
2> instantiation of "void std::basic_string<_Elem, _Traits, _Alloc>::_Tidy_deallocate() [with _Elem=char, _Traits=std::char_traits<char>, _Alloc=std::allocator<char>]"
2>D:\Program Files\Microsoft Visual Studio\2019\Community\VC\Tools\MSVC\14.29.30133\include\xstring(3003): here
2> instantiation of "std::basic_string<_Elem, _Traits, _Alloc>::~basic_string() [with _Elem=char, _Traits=std::char_traits<char>, _Alloc=std::allocator<char>]"
2>D:\Program Files\Microsoft Visual Studio\2019\Community\VC\Tools\MSVC\14.29.30133\include\string(539): here
2>
2>D:\Program Files\Microsoft Visual Studio\2019\Community\VC\Tools\MSVC\14.29.30133\include\xmemory(959): error : expected a "("
2> detected during:
2> instantiation of "void std::_Destroy_range(_NoThrowFwdIt, _NoThrowSentinel) [with _NoThrowFwdIt=char, _NoThrowSentinel=unsigned long long]"
2>(309): here
2> instantiation of "void std::_Destroy_in_place(_Ty &) [with _Ty=char]"
2>(961): here
2> instantiation of "void std::_Destroy_range(_NoThrowFwdIt, _NoThrowSentinel) [with _NoThrowFwdIt=char *, _NoThrowSentinel=char *]"
2>(309): here
2> instantiation of "void std::_Destroy_in_place(_Ty &) [with _Ty=char *]"
2>D:\Program Files\Microsoft Visual Studio\2019\Community\VC\Tools\MSVC\14.29.30133\include\xstring(4621): here
2> instantiation of "void std::basic_string<_Elem, _Traits, _Alloc>::_Tidy_deallocate() [with _Elem=char, _Traits=std::char_traits<char>, _Alloc=std::allocator<char>]"
2>D:\Program Files\Microsoft Visual Studio\2019\Community\VC\Tools\MSVC\14.29.30133\include\xstring(3003): here
2> instantiation of "std::basic_string<_Elem, _Traits, _Alloc>::~basic_string() [with _Elem=char, _Traits=std::char_traits<char>, _Alloc=std::allocator<char>]"
2>D:\Program Files\Microsoft Visual Studio\2019\Community\VC\Tools\MSVC\14.29.30133\include\string(539): here
2>
2>D:\Program Files\Microsoft Visual Studio\2019\Community\VC\Tools\MSVC\14.29.30133\include\xutility(1236): error : class "std::iterator_traits<char>" has no member "value_type"
2> detected during:
2> instantiation of type "std::_Iter_value_t<char>"
2>D:\Program Files\Microsoft Visual Studio\2019\Community\VC\Tools\MSVC\14.29.30133\include\xmemory(959): here
2> instantiation of "void std::_Destroy_range(_NoThrowFwdIt, _NoThrowSentinel) [with _NoThrowFwdIt=char, _NoThrowSentinel=unsigned long long]"
2>D:\Program Files\Microsoft Visual Studio\2019\Community\VC\Tools\MSVC\14.29.30133\include\xmemory(309): here
2> instantiation of "void std::_Destroy_in_place(_Ty &) [with _Ty=char]"
2>D:\Program Files\Microsoft Visual Studio\2019\Community\VC\Tools\MSVC\14.29.30133\include\xmemory(961): here
2> instantiation of "void std::_Destroy_range(_NoThrowFwdIt, _NoThrowSentinel) [with _NoThrowFwdIt=char *, _NoThrowSentinel=char *]"
2>D:\Program Files\Microsoft Visual Studio\2019\Community\VC\Tools\MSVC\14.29.30133\include\xmemory(309): here
2> instantiation of "void std::_Destroy_in_place(_Ty &) [with _Ty=char *]"
2>D:\Program Files\Microsoft Visual Studio\2019\Community\VC\Tools\MSVC\14.29.30133\include\xstring(4621): here
2> instantiation of "void std::basic_string<_Elem, _Traits, _Alloc>::_Tidy_deallocate() [with _Elem=char, _Traits=std::char_traits<char>, _Alloc=std::allocator<char>]"
2>D:\Program Files\Microsoft Visual Studio\2019\Community\VC\Tools\MSVC\14.29.30133\include\xstring(3003): here
2> instantiation of "std::basic_string<_Elem, _Traits, _Alloc>::~basic_string() [with _Elem=char, _Traits=std::char_traits<char>, _Alloc=std::allocator<char>]"
2>D:\Program Files\Microsoft Visual Studio\2019\Community\VC\Tools\MSVC\14.29.30133\include\string(539): here
2>
2>D:\Program Files\Microsoft Visual Studio\2019\Community\VC\Tools\MSVC\14.29.30133\include\xmemory(961): error : operand of "*" must be a pointer
2> detected during:
2> instantiation of "void std::_Destroy_range(_NoThrowFwdIt, _NoThrowSentinel) [with _NoThrowFwdIt=char, _NoThrowSentinel=unsigned long long]"
2>(309): here
2> instantiation of "void std::_Destroy_in_place(_Ty &) [with _Ty=char]"
2>(961): here
2> instantiation of "void std::_Destroy_range(_NoThrowFwdIt, _NoThrowSentinel) [with _NoThrowFwdIt=char *, _NoThrowSentinel=char *]"
2>(309): here
2> instantiation of "void std::_Destroy_in_place(_Ty &) [with _Ty=char *]"
2>D:\Program Files\Microsoft Visual Studio\2019\Community\VC\Tools\MSVC\14.29.30133\include\xstring(4621): here
2> instantiation of "void std::basic_string<_Elem, _Traits, _Alloc>::_Tidy_deallocate() [with _Elem=char, _Traits=std::char_traits<char>, _Alloc=std::allocator<char>]"
2>D:\Program Files\Microsoft Visual Studio\2019\Community\VC\Tools\MSVC\14.29.30133\include\xstring(3003): here
2> instantiation of "std::basic_string<_Elem, _Traits, _Alloc>::~basic_string() [with _Elem=char, _Traits=std::char_traits<char>, _Alloc=std::allocator<char>]"
2>D:\Program Files\Microsoft Visual Studio\2019\Community\VC\Tools\MSVC\14.29.30133\include\string(539): here
2>
2>D:\Program Files\Microsoft Visual Studio\2019\Community\VC\Tools\MSVC\14.29.30133\include\xmemory(62): error : expected a "("
2> detected during:
2> instantiation of "size_t std::_Get_size_of_n<_Ty_size>(size_t) [with _Ty_size=2ULL]"
2>(839): here
2> instantiation of "_Ty *std::allocator<_Ty>::allocate(size_t) [with _Ty=__wchar_t]"
2>D:\Program Files\Microsoft Visual Studio\2019\Community\VC\Tools\MSVC\14.29.30133\include\xstring(4515): here
2> instantiation of "std::basic_string<_Elem, _Traits, _Alloc> &std::basic_string<_Elem, _Traits, _Alloc>::_Reallocate_for(std::basic_string<_Elem, _Traits, _Alloc>::size_type, _Fty, _ArgTys...) [with _Elem=__wchar_t, _Traits=std::char_traits<__wchar_t>, _Alloc=std::allocator<__wchar_t>, _Fty=lambda [](__wchar_t *, size_t, const __wchar_t *)->void, _ArgTys=<const __wchar_t *>]"
2>D:\Program Files\Microsoft Visual Studio\2019\Community\VC\Tools\MSVC\14.29.30133\include\xstring(3260): here
2> instantiation of "std::basic_string<_Elem, _Traits, _Alloc> &std::basic_string<_Elem, _Traits, _Alloc>::assign(const _Elem *, std::basic_string<_Elem, _Traits, _Alloc>::size_type) [with _Elem=__wchar_t, _Traits=std::char_traits<__wchar_t>, _Alloc=std::allocator<__wchar_t>]"
2>D:\Program Files\Microsoft Visual Studio\2019\Community\VC\Tools\MSVC\14.29.30133\include\xstring(2503): here
2> instantiation of "std::basic_string<_Elem, _Traits, _Alloc>::basic_string(const _Elem *, std::basic_string<_Elem, _Traits, _Alloc>::size_type) [with _Elem=__wchar_t, _Traits=std::char_traits<__wchar_t>, _Alloc=std::allocator<__wchar_t>]"
2>D:\Program Files\Microsoft Visual Studio\2019\Community\VC\Tools\MSVC\14.29.30133\include\xstring(5001): here
2>
2>D:\Program Files\Microsoft Visual Studio\2019\Community\VC\Tools\MSVC\14.29.30133\include\xutility(131): error : expected a "("
2> detected during:
2> instantiation of "void *std::_Voidify_iter(_Iter) [with _Iter=__wchar_t **]"
2>(158): here
2> instantiation of "void std::_Construct_in_place(_Ty &, _Types &&...) [with _Ty=__wchar_t *, _Types=<__wchar_t *const &>]"
2>D:\Program Files\Microsoft Visual Studio\2019\Community\VC\Tools\MSVC\14.29.30133\include\xstring(4530): here
2> instantiation of "std::basic_string<_Elem, _Traits, _Alloc> &std::basic_string<_Elem, _Traits, _Alloc>::_Reallocate_for(std::basic_string<_Elem, _Traits, _Alloc>::size_type, _Fty, _ArgTys...) [with _Elem=__wchar_t, _Traits=std::char_traits<__wchar_t>, _Alloc=std::allocator<__wchar_t>, _Fty=lambda [](__wchar_t *, size_t, const __wchar_t *)->void, _ArgTys=<const __wchar_t *>]"
2>D:\Program Files\Microsoft Visual Studio\2019\Community\VC\Tools\MSVC\14.29.30133\include\xstring(3260): here
2> instantiation of "std::basic_string<_Elem, _Traits, _Alloc> &std::basic_string<_Elem, _Traits, _Alloc>::assign(const _Elem *, std::basic_string<_Elem, _Traits, _Alloc>::size_type) [with _Elem=__wchar_t, _Traits=std::char_traits<__wchar_t>, _Alloc=std::allocator<__wchar_t>]"
2>D:\Program Files\Microsoft Visual Studio\2019\Community\VC\Tools\MSVC\14.29.30133\include\xstring(2503): here
2> instantiation of "std::basic_string<_Elem, _Traits, _Alloc>::basic_string(const _Elem *, std::basic_string<_Elem, _Traits, _Alloc>::size_type) [with _Elem=__wchar_t, _Traits=std::char_traits<__wchar_t>, _Alloc=std::allocator<__wchar_t>]"
2>D:\Program Files\Microsoft Visual Studio\2019\Community\VC\Tools\MSVC\14.29.30133\include\xstring(5001): here
2>
2>D:\Program Files\Microsoft Visual Studio\2019\Community\VC\Tools\MSVC\14.29.30133\include\xstring(2881): error : expected a "("
2> detected during:
2> instantiation of "void std::basic_string<_Elem, _Traits, _Alloc>::_Take_contents(std::basic_string<_Elem, _Traits, _Alloc> &) [with _Elem=__wchar_t, _Traits=std::char_traits<__wchar_t>, _Alloc=std::allocator<__wchar_t>]"
2>(2607): here
2> instantiation of "std::basic_string<_Elem, _Traits, _Alloc>::basic_string(std::basic_string<_Elem, _Traits, _Alloc> &&) [with _Elem=__wchar_t, _Traits=std::char_traits<__wchar_t>, _Alloc=std::allocator<__wchar_t>]"
2>D:\Program Files\Microsoft Visual Studio\2019\Community\VC\Tools\MSVC\14.29.30133\include\string(581): here
2>
2>D:\Program Files\Microsoft Visual Studio\2019\Community\VC\Tools\MSVC\14.29.30133\include\xmemory(308): error : expected a "("
2> detected during:
2> instantiation of "void std::_Destroy_in_place(_Ty &) [with _Ty=__wchar_t *]"
2>D:\Program Files\Microsoft Visual Studio\2019\Community\VC\Tools\MSVC\14.29.30133\include\xstring(4621): here
2> instantiation of "void std::basic_string<_Elem, _Traits, _Alloc>::_Tidy_deallocate() [with _Elem=__wchar_t, _Traits=std::char_traits<__wchar_t>, _Alloc=std::allocator<__wchar_t>]"
2>D:\Program Files\Microsoft Visual Studio\2019\Community\VC\Tools\MSVC\14.29.30133\include\xstring(3003): here
2> instantiation of "std::basic_string<_Elem, _Traits, _Alloc>::~basic_string() [with _Elem=__wchar_t, _Traits=std::char_traits<__wchar_t>, _Alloc=std::allocator<__wchar_t>]"
2>D:\Program Files\Microsoft Visual Studio\2019\Community\VC\Tools\MSVC\14.29.30133\include\string(579): here
2>
2>D:\Program Files\Microsoft Visual Studio\2019\Community\VC\Tools\MSVC\14.29.30133\include\xmemory(959): error : expected a "("
2> detected during:
2> instantiation of "void std::_Destroy_range(_NoThrowFwdIt, _NoThrowSentinel) [with _NoThrowFwdIt=__wchar_t *, _NoThrowSentinel=__wchar_t *]"
2>(309): here
2> instantiation of "void std::_Destroy_in_place(_Ty &) [with _Ty=__wchar_t *]"
2>D:\Program Files\Microsoft Visual Studio\2019\Community\VC\Tools\MSVC\14.29.30133\include\xstring(4621): here
2> instantiation of "void std::basic_string<_Elem, _Traits, _Alloc>::_Tidy_deallocate() [with _Elem=__wchar_t, _Traits=std::char_traits<__wchar_t>, _Alloc=std::allocator<__wchar_t>]"
2>D:\Program Files\Microsoft Visual Studio\2019\Community\VC\Tools\MSVC\14.29.30133\include\xstring(3003): here
2> instantiation of "std::basic_string<_Elem, _Traits, _Alloc>::~basic_string() [with _Elem=__wchar_t, _Traits=std::char_traits<__wchar_t>, _Alloc=std::allocator<__wchar_t>]"
2>D:\Program Files\Microsoft Visual Studio\2019\Community\VC\Tools\MSVC\14.29.30133\include\string(579): here
2>
2>D:\Program Files\Microsoft Visual Studio\2019\Community\VC\Tools\MSVC\14.29.30133\include\xmemory(308): error : expected a "("
2> detected during:
2> instantiation of "void std::_Destroy_in_place(_Ty &) [with _Ty=__wchar_t]"
2>(961): here
2> instantiation of "void std::_Destroy_range(_NoThrowFwdIt, _NoThrowSentinel) [with _NoThrowFwdIt=__wchar_t *, _NoThrowSentinel=__wchar_t *]"
2>(309): here
2> instantiation of "void std::_Destroy_in_place(_Ty &) [with _Ty=__wchar_t *]"
2>D:\Program Files\Microsoft Visual Studio\2019\Community\VC\Tools\MSVC\14.29.30133\include\xstring(4621): here
2> instantiation of "void std::basic_string<_Elem, _Traits, _Alloc>::_Tidy_deallocate() [with _Elem=__wchar_t, _Traits=std::char_traits<__wchar_t>, _Alloc=std::allocator<__wchar_t>]"
2>D:\Program Files\Microsoft Visual Studio\2019\Community\VC\Tools\MSVC\14.29.30133\include\xstring(3003): here
2> instantiation of "std::basic_string<_Elem, _Traits, _Alloc>::~basic_string() [with _Elem=__wchar_t, _Traits=std::char_traits<__wchar_t>, _Alloc=std::allocator<__wchar_t>]"
2>D:\Program Files\Microsoft Visual Studio\2019\Community\VC\Tools\MSVC\14.29.30133\include\string(579): here
2>
2>D:\Program Files\Microsoft Visual Studio\2019\Community\VC\Tools\MSVC\14.29.30133\include\xmemory(959): error : expected a "("
2> detected during:
2> instantiation of "void std::_Destroy_range(_NoThrowFwdIt, _NoThrowSentinel) [with _NoThrowFwdIt=__wchar_t, _NoThrowSentinel=unsigned long long]"
2>(309): here
2> instantiation of "void std::_Destroy_in_place(_Ty &) [with _Ty=__wchar_t]"
2>(961): here
2> instantiation of "void std::_Destroy_range(_NoThrowFwdIt, _NoThrowSentinel) [with _NoThrowFwdIt=__wchar_t *, _NoThrowSentinel=__wchar_t *]"
2>(309): here
2> instantiation of "void std::_Destroy_in_place(_Ty &) [with _Ty=__wchar_t *]"
2>D:\Program Files\Microsoft Visual Studio\2019\Community\VC\Tools\MSVC\14.29.30133\include\xstring(4621): here
2> instantiation of "void std::basic_string<_Elem, _Traits, _Alloc>::_Tidy_deallocate() [with _Elem=__wchar_t, _Traits=std::char_traits<__wchar_t>, _Alloc=std::allocator<__wchar_t>]"
2>D:\Program Files\Microsoft Visual Studio\2019\Community\VC\Tools\MSVC\14.29.30133\include\xstring(3003): here
2> instantiation of "std::basic_string<_Elem, _Traits, _Alloc>::~basic_string() [with _Elem=__wchar_t, _Traits=std::char_traits<__wchar_t>, _Alloc=std::allocator<__wchar_t>]"
2>D:\Program Files\Microsoft Visual Studio\2019\Community\VC\Tools\MSVC\14.29.30133\include\string(579): here
2>
2>D:\Program Files\Microsoft Visual Studio\2019\Community\VC\Tools\MSVC\14.29.30133\include\xutility(1236): error : class "std::iterator_traits<__wchar_t>" has no member "value_type"
2> detected during:
2> instantiation of type "std::_Iter_value_t<__wchar_t>"
2>D:\Program Files\Microsoft Visual Studio\2019\Community\VC\Tools\MSVC\14.29.30133\include\xmemory(959): here
2> instantiation of "void std::_Destroy_range(_NoThrowFwdIt, _NoThrowSentinel) [with _NoThrowFwdIt=__wchar_t, _NoThrowSentinel=unsigned long long]"
2>D:\Program Files\Microsoft Visual Studio\2019\Community\VC\Tools\MSVC\14.29.30133\include\xmemory(309): here
2> instantiation of "void std::_Destroy_in_place(_Ty &) [with _Ty=__wchar_t]"
2>D:\Program Files\Microsoft Visual Studio\2019\Community\VC\Tools\MSVC\14.29.30133\include\xmemory(961): here
2> instantiation of "void std::_Destroy_range(_NoThrowFwdIt, _NoThrowSentinel) [with _NoThrowFwdIt=__wchar_t *, _NoThrowSentinel=__wchar_t *]"
2>D:\Program Files\Microsoft Visual Studio\2019\Community\VC\Tools\MSVC\14.29.30133\include\xmemory(309): here
2> instantiation of "void std::_Destroy_in_place(_Ty &) [with _Ty=__wchar_t *]"
2>D:\Program Files\Microsoft Visual Studio\2019\Community\VC\Tools\MSVC\14.29.30133\include\xstring(4621): here
2> instantiation of "void std::basic_string<_Elem, _Traits, _Alloc>::_Tidy_deallocate() [with _Elem=__wchar_t, _Traits=std::char_traits<__wchar_t>, _Alloc=std::allocator<__wchar_t>]"
2>D:\Program Files\Microsoft Visual Studio\2019\Community\VC\Tools\MSVC\14.29.30133\include\xstring(3003): here
2> instantiation of "std::basic_string<_Elem, _Traits, _Alloc>::~basic_string() [with _Elem=__wchar_t, _Traits=std::char_traits<__wchar_t>, _Alloc=std::allocator<__wchar_t>]"
2>D:\Program Files\Microsoft Visual Studio\2019\Community\VC\Tools\MSVC\14.29.30133\include\string(579): here
2>
2>D:\Program Files\Microsoft Visual Studio\2019\Community\VC\Tools\MSVC\14.29.30133\include\xmemory(961): error : operand of "*" must be a pointer
2> detected during:
2> instantiation of "void std::_Destroy_range(_NoThrowFwdIt, _NoThrowSentinel) [with _NoThrowFwdIt=__wchar_t, _NoThrowSentinel=unsigned long long]"
2>(309): here
2> instantiation of "void std::_Destroy_in_place(_Ty &) [with _Ty=__wchar_t]"
2>(961): here
2> instantiation of "void std::_Destroy_range(_NoThrowFwdIt, _NoThrowSentinel) [with _NoThrowFwdIt=__wchar_t *, _NoThrowSentinel=__wchar_t *]"
2>(309): here
2> instantiation of "void std::_Destroy_in_place(_Ty &) [with _Ty=__wchar_t *]"
2>D:\Program Files\Microsoft Visual Studio\2019\Community\VC\Tools\MSVC\14.29.30133\include\xstring(4621): here
2> instantiation of "void std::basic_string<_Elem, _Traits, _Alloc>::_Tidy_deallocate() [with _Elem=__wchar_t, _Traits=std::char_traits<__wchar_t>, _Alloc=std::allocator<__wchar_t>]"
2>D:\Program Files\Microsoft Visual Studio\2019\Community\VC\Tools\MSVC\14.29.30133\include\xstring(3003): here
2> instantiation of "std::basic_string<_Elem, _Traits, _Alloc>::~basic_string() [with _Elem=__wchar_t, _Traits=std::char_traits<__wchar_t>, _Alloc=std::allocator<__wchar_t>]"
2>D:\Program Files\Microsoft Visual Studio\2019\Community\VC\Tools\MSVC\14.29.30133\include\string(579): here
2>
2>D:\Program Files\Microsoft Visual Studio\2019\Community\VC\Tools\MSVC\14.29.30133\include\xutility(131): error : expected a "("
2> detected during:
2> instantiation of "void *std::_Voidify_iter(_Iter) [with _Iter=char16_t **]"
2>(158): here
2> instantiation of "void std::_Construct_in_place(_Ty &, _Types &&...) [with _Ty=char16_t *, _Types=<char16_t *const &>]"
2>D:\Program Files\Microsoft Visual Studio\2019\Community\VC\Tools\MSVC\14.29.30133\include\xstring(4530): here
2> instantiation of "std::basic_string<_Elem, _Traits, _Alloc> &std::basic_string<_Elem, _Traits, _Alloc>::_Reallocate_for(std::basic_string<_Elem, _Traits, _Alloc>::size_type, _Fty, _ArgTys...) [with _Elem=char16_t, _Traits=std::char_traits<char16_t>, _Alloc=std::allocator<char16_t>, _Fty=lambda [](char16_t *, size_t, const char16_t *)->void, _ArgTys=<const char16_t *>]"
2>D:\Program Files\Microsoft Visual Studio\2019\Community\VC\Tools\MSVC\14.29.30133\include\xstring(3260): here
2> instantiation of "std::basic_string<_Elem, _Traits, _Alloc> &std::basic_string<_Elem, _Traits, _Alloc>::assign(const _Elem *, std::basic_string<_Elem, _Traits, _Alloc>::size_type) [with _Elem=char16_t, _Traits=std::char_traits<char16_t>, _Alloc=std::allocator<char16_t>]"
2>D:\Program Files\Microsoft Visual Studio\2019\Community\VC\Tools\MSVC\14.29.30133\include\xstring(2503): here
2> instantiation of "std::basic_string<_Elem, _Traits, _Alloc>::basic_string(const _Elem *, std::basic_string<_Elem, _Traits, _Alloc>::size_type) [with _Elem=char16_t, _Traits=std::char_traits<char16_t>, _Alloc=std::allocator<char16_t>]"
2>D:\Program Files\Microsoft Visual Studio\2019\Community\VC\Tools\MSVC\14.29.30133\include\xstring(5011): here
2>
2>D:\Program Files\Microsoft Visual Studio\2019\Community\VC\Tools\MSVC\14.29.30133\include\xmemory(62): error : expected a "("
2> detected during:
2> instantiation of "size_t std::_Get_size_of_n<_Ty_size>(size_t) [with _Ty_size=4ULL]"
2>(839): here
2> instantiation of "_Ty *std::allocator<_Ty>::allocate(size_t) [with _Ty=char32_t]"
2>D:\Program Files\Microsoft Visual Studio\2019\Community\VC\Tools\MSVC\14.29.30133\include\xstring(4515): here
2> instantiation of "std::basic_string<_Elem, _Traits, _Alloc> &std::basic_string<_Elem, _Traits, _Alloc>::_Reallocate_for(std::basic_string<_Elem, _Traits, _Alloc>::size_type, _Fty, _ArgTys...) [with _Elem=char32_t, _Traits=std::char_traits<char32_t>, _Alloc=std::allocator<char32_t>, _Fty=lambda [](char32_t *, size_t, const char32_t *)->void, _ArgTys=<const char32_t *>]"
2>D:\Program Files\Microsoft Visual Studio\2019\Community\VC\Tools\MSVC\14.29.30133\include\xstring(3260): here
2> instantiation of "std::basic_string<_Elem, _Traits, _Alloc> &std::basic_string<_Elem, _Traits, _Alloc>::assign(const _Elem *, std::basic_string<_Elem, _Traits, _Alloc>::size_type) [with _Elem=char32_t, _Traits=std::char_traits<char32_t>, _Alloc=std::allocator<char32_t>]"
2>D:\Program Files\Microsoft Visual Studio\2019\Community\VC\Tools\MSVC\14.29.30133\include\xstring(2503): here
2> instantiation of "std::basic_string<_Elem, _Traits, _Alloc>::basic_string(const _Elem *, std::basic_string<_Elem, _Traits, _Alloc>::size_type) [with _Elem=char32_t, _Traits=std::char_traits<char32_t>, _Alloc=std::allocator<char32_t>]"
2>D:\Program Files\Microsoft Visual Studio\2019\Community\VC\Tools\MSVC\14.29.30133\include\xstring(5015): here
2>
2>D:\Program Files\Microsoft Visual Studio\2019\Community\VC\Tools\MSVC\14.29.30133\include\xutility(131): error : expected a "("
2> detected during:
2> instantiation of "void *std::_Voidify_iter(_Iter) [with _Iter=char32_t **]"
2>(158): here
2> instantiation of "void std::_Construct_in_place(_Ty &, _Types &&...) [with _Ty=char32_t *, _Types=<char32_t *const &>]"
2>D:\Program Files\Microsoft Visual Studio\2019\Community\VC\Tools\MSVC\14.29.30133\include\xstring(4530): here
2> instantiation of "std::basic_string<_Elem, _Traits, _Alloc> &std::basic_string<_Elem, _Traits, _Alloc>::_Reallocate_for(std::basic_string<_Elem, _Traits, _Alloc>::size_type, _Fty, _ArgTys...) [with _Elem=char32_t, _Traits=std::char_traits<char32_t>, _Alloc=std::allocator<char32_t>, _Fty=lambda [](char32_t *, size_t, const char32_t *)->void, _ArgTys=<const char32_t *>]"
2>D:\Program Files\Microsoft Visual Studio\2019\Community\VC\Tools\MSVC\14.29.30133\include\xstring(3260): here
2> instantiation of "std::basic_string<_Elem, _Traits, _Alloc> &std::basic_string<_Elem, _Traits, _Alloc>::assign(const _Elem *, std::basic_string<_Elem, _Traits, _Alloc>::size_type) [with _Elem=char32_t, _Traits=std::char_traits<char32_t>, _Alloc=std::allocator<char32_t>]"
2>D:\Program Files\Microsoft Visual Studio\2019\Community\VC\Tools\MSVC\14.29.30133\include\xstring(2503): here
2> instantiation of "std::basic_string<_Elem, _Traits, _Alloc>::basic_string(const _Elem *, std::basic_string<_Elem, _Traits, _Alloc>::size_type) [with _Elem=char32_t, _Traits=std::char_traits<char32_t>, _Alloc=std::allocator<char32_t>]"
2>D:\Program Files\Microsoft Visual Studio\2019\Community\VC\Tools\MSVC\14.29.30133\include\xstring(5015): here
2>
2>D:\Program Files\Microsoft Visual Studio\2019\Community\VC\Tools\MSVC\14.29.30133\include\xutility(1326): error : expected a "("
2> detected during:
2> instantiation of "decltype(auto) std::_Get_unwrapped(_Iter &&) [with _Iter=char *&]"
2>D:\Program Files\Microsoft Visual Studio\2019\Community\VC\Tools\MSVC\14.29.30133\include\xstring(2566): here
2> instantiation of "std::basic_string<_Elem, _Traits, _Alloc>::basic_string(_Iter, _Iter, const _Alloc &) [with _Elem=char, _Traits=std::char_traits<char>, _Alloc=std::allocator<char>, _Iter=char *, <unnamed>=0]"
2>D:\Program Files\Microsoft Visual Studio\2019\Community\VC\Tools\MSVC\14.29.30133\include\string(498): here
2> instantiation of "std::basic_string<_Elem, std::char_traits<_Elem>, std::allocator<_Elem>> std::_Integral_to_string<_Elem,_Ty>(_Ty) [with _Elem=char, _Ty=int]"
2>D:\Program Files\Microsoft Visual Studio\2019\Community\VC\Tools\MSVC\14.29.30133\include\string(514): here
2>
2>D:\Program Files\Microsoft Visual Studio\2019\Community\VC\Tools\MSVC\14.29.30133\include\xutility(1328): error : expected a "("
2> detected during:
2> instantiation of "decltype(auto) std::_Get_unwrapped(_Iter &&) [with _Iter=char *&]"
2>D:\Program Files\Microsoft Visual Studio\2019\Community\VC\Tools\MSVC\14.29.30133\include\xstring(2566): here
2> instantiation of "std::basic_string<_Elem, _Traits, _Alloc>::basic_string(_Iter, _Iter, const _Alloc &) [with _Elem=char, _Traits=std::char_traits<char>, _Alloc=std::allocator<char>, _Iter=char *, <unnamed>=0]"
2>D:\Program Files\Microsoft Visual Studio\2019\Community\VC\Tools\MSVC\14.29.30133\include\string(498): here
2> instantiation of "std::basic_string<_Elem, std::char_traits<_Elem>, std::allocator<_Elem>> std::_Integral_to_string<_Elem,_Ty>(_Ty) [with _Elem=char, _Ty=int]"
2>D:\Program Files\Microsoft Visual Studio\2019\Community\VC\Tools\MSVC\14.29.30133\include\string(514): here
2>
2>D:\Program Files\Microsoft Visual Studio\2019\Community\VC\Tools\MSVC\14.29.30133\include\xutility(1329): error : expression must have class type
2> detected during:
2> instantiation of "decltype(auto) std::_Get_unwrapped(_Iter &&) [with _Iter=char *&]"
2>D:\Program Files\Microsoft Visual Studio\2019\Community\VC\Tools\MSVC\14.29.30133\include\xstring(2566): here
2> instantiation of "std::basic_string<_Elem, _Traits, _Alloc>::basic_string(_Iter, _Iter, const _Alloc &) [with _Elem=char, _Traits=std::char_traits<char>, _Alloc=std::allocator<char>, _Iter=char *, <unnamed>=0]"
2>D:\Program Files\Microsoft Visual Studio\2019\Community\VC\Tools\MSVC\14.29.30133\include\string(498): here
2> instantiation of "std::basic_string<_Elem, std::char_traits<_Elem>, std::allocator<_Elem>> std::_Integral_to_string<_Elem,_Ty>(_Ty) [with _Elem=char, _Ty=int]"
2>D:\Program Files\Microsoft Visual Studio\2019\Community\VC\Tools\MSVC\14.29.30133\include\string(514): here
2>
2>D:\Program Files\Microsoft Visual Studio\2019\Community\VC\Tools\MSVC\14.29.30133\include\xutility(1326): error : expected a "("
2> detected during:
2> instantiation of "decltype(auto) std::_Get_unwrapped(_Iter &&) [with _Iter=__wchar_t *&]"
2>D:\Program Files\Microsoft Visual Studio\2019\Community\VC\Tools\MSVC\14.29.30133\include\xstring(2566): here
2> instantiation of "std::basic_string<_Elem, _Traits, _Alloc>::basic_string(_Iter, _Iter, const _Alloc &) [with _Elem=__wchar_t, _Traits=std::char_traits<__wchar_t>, _Alloc=std::allocator<__wchar_t>, _Iter=__wchar_t *, <unnamed>=0]"
2>D:\Program Files\Microsoft Visual Studio\2019\Community\VC\Tools\MSVC\14.29.30133\include\string(498): here
2> instantiation of "std::basic_string<_Elem, std::char_traits<_Elem>, std::allocator<_Elem>> std::_Integral_to_string<_Elem,_Ty>(_Ty) [with _Elem=__wchar_t, _Ty=int]"
2>D:\Program Files\Microsoft Visual Studio\2019\Community\VC\Tools\MSVC\14.29.30133\include\string(554): here
2>
2>D:\Program Files\Microsoft Visual Studio\2019\Community\VC\Tools\MSVC\14.29.30133\include\xutility(1328): error : expected a "("
2> detected during:
2> instantiation of "decltype(auto) std::_Get_unwrapped(_Iter &&) [with _Iter=__wchar_t *&]"
2>D:\Program Files\Microsoft Visual Studio\2019\Community\VC\Tools\MSVC\14.29.30133\include\xstring(2566): here
2> instantiation of "std::basic_string<_Elem, _Traits, _Alloc>::basic_string(_Iter, _Iter, const _Alloc &) [with _Elem=__wchar_t, _Traits=std::char_traits<__wchar_t>, _Alloc=std::allocator<__wchar_t>, _Iter=__wchar_t *, <unnamed>=0]"
2>D:\Program Files\Microsoft Visual Studio\2019\Community\VC\Tools\MSVC\14.29.30133\include\string(498): here
2> instantiation of "std::basic_string<_Elem, std::char_traits<_Elem>, std::allocator<_Elem>> std::_Integral_to_string<_Elem,_Ty>(_Ty) [with _Elem=__wchar_t, _Ty=int]"
2>D:\Program Files\Microsoft Visual Studio\2019\Community\VC\Tools\MSVC\14.29.30133\include\string(554): here
2>
2>D:\Program Files\Microsoft Visual Studio\2019\Community\VC\Tools\MSVC\14.29.30133\include\xutility(1329): error : expression must have class type
2> detected during:
2> instantiation of "decltype(auto) std::_Get_unwrapped(_Iter &&) [with _Iter=__wchar_t *&]"
2>D:\Program Files\Microsoft Visual Studio\2019\Community\VC\Tools\MSVC\14.29.30133\include\xstring(2566): here
2> instantiation of "std::basic_string<_Elem, _Traits, _Alloc>::basic_string(_Iter, _Iter, const _Alloc &) [with _Elem=__wchar_t, _Traits=std::char_traits<__wchar_t>, _Alloc=std::allocator<__wchar_t>, _Iter=__wchar_t *, <unnamed>=0]"
2>D:\Program Files\Microsoft Visual Studio\2019\Community\VC\Tools\MSVC\14.29.30133\include\string(498): here
2> instantiation of "std::basic_string<_Elem, std::char_traits<_Elem>, std::allocator<_Elem>> std::_Integral_to_string<_Elem,_Ty>(_Ty) [with _Elem=__wchar_t, _Ty=int]"
2>D:\Program Files\Microsoft Visual Studio\2019\Community\VC\Tools\MSVC\14.29.30133\include\string(554): here
2>
2>D:\Program Files\Microsoft Visual Studio\2019\Community\VC\Tools\MSVC\14.29.30133\include\atomic(368): error : expected a "("
2> detected during:
2> instantiation of "_Integral std::_Atomic_reinterpret_as<_Integral,_Ty>(const _Ty &) [with _Integral=int, _Ty=std::remove_reference_t<long>]"
2>(987): here
2> instantiation of "void std::_Atomic_storage<_Ty, 4ULL>::store(std::_Atomic_storage<_Ty, 4ULL>::_TVal, std::memory_order) [with _Ty=long]"
2>(2944): here
2>
2>D:\Program Files\Microsoft Visual Studio\2019\Community\VC\Tools\MSVC\14.29.30133\include\atomic(370): error : expected a "("
2> detected during:
2> instantiation of "_Integral std::_Atomic_reinterpret_as<_Integral,_Ty>(const _Ty &) [with _Integral=int, _Ty=std::remove_reference_t<long>]"
2>(987): here
2> instantiation of "void std::_Atomic_storage<_Ty, 4ULL>::store(std::_Atomic_storage<_Ty, 4ULL>::_TVal, std::memory_order) [with _Ty=long]"
2>(2944): here
2>
2>D:\Program Files\Microsoft Visual Studio\2019\Community\VC\Tools\MSVC\14.29.30133\include\atomic(371): error : invalid type conversion
2> detected during:
2> instantiation of "_Integral std::_Atomic_reinterpret_as<_Integral,_Ty>(const _Ty &) [with _Integral=int, _Ty=std::remove_reference_t<long>]"
2>(987): here
2> instantiation of "void std::_Atomic_storage<_Ty, 4ULL>::store(std::_Atomic_storage<_Ty, 4ULL>::_TVal, std::memory_order) [with _Ty=long]"
2>(2944): here
2>
2>D:\Program Files\Microsoft Visual Studio\2019\Community\VC\Tools\MSVC\14.29.30133\include\atomic(368): error : expected a "("
2> detected during:
2> instantiation of "_Integral std::_Atomic_reinterpret_as<_Integral,_Ty>(const _Ty &) [with _Integral=long, _Ty=std::remove_reference_t<long>]"
2>(981): here
2> instantiation of "void std::_Atomic_storage<_Ty, 4ULL>::store(std::_Atomic_storage<_Ty, 4ULL>::_TVal) [with _Ty=long]"
2>(1003): here
2> instantiation of "void std::_Atomic_storage<_Ty, 4ULL>::store(std::_Atomic_storage<_Ty, 4ULL>::_TVal, std::memory_order) [with _Ty=long]"
2>(2944): here
2>
2>D:\Program Files\Microsoft Visual Studio\2019\Community\VC\Tools\MSVC\14.29.30133\include\atomic(370): error : expected a "("
2> detected during:
2> instantiation of "_Integral std::_Atomic_reinterpret_as<_Integral,_Ty>(const _Ty &) [with _Integral=long, _Ty=std::remove_reference_t<long>]"
2>(981): here
2> instantiation of "void std::_Atomic_storage<_Ty, 4ULL>::store(std::_Atomic_storage<_Ty, 4ULL>::_TVal) [with _Ty=long]"
2>(1003): here
2> instantiation of "void std::_Atomic_storage<_Ty, 4ULL>::store(std::_Atomic_storage<_Ty, 4ULL>::_TVal, std::memory_order) [with _Ty=long]"
2>(2944): here
2>
2>D:\Program Files\Microsoft Visual Studio\2019\Community\VC\Tools\MSVC\14.29.30133\include\xmemory(927): error : expected a "("
2> detected during:
2> instantiation of "void std::_Pocma(_Alloc &, _Alloc &) [with _Alloc=std::_Rebind_alloc_t<std::allocator<char>, char>]"
2>D:\Program Files\Microsoft Visual Studio\2019\Community\VC\Tools\MSVC\14.29.30133\include\xstring(2777): here
2> instantiation of "void std::basic_string<_Elem, _Traits, _Alloc>::_Move_assign(std::basic_string<_Elem, _Traits, _Alloc> &, std::_Equal_allocators) [with _Elem=char, _Traits=std::char_traits<char>, _Alloc=std::allocator<char>]"
2>D:\Program Files\Microsoft Visual Studio\2019\Community\VC\Tools\MSVC\14.29.30133\include\xstring(2851): here
2> instantiation of "std::basic_string<_Elem, _Traits, _Alloc> &std::basic_string<_Elem, _Traits, _Alloc>::operator=(std::basic_string<_Elem, _Traits, _Alloc> &&) [with _Elem=char, _Traits=std::char_traits<char>, _Alloc=std::allocator<char>]"
2>D:\Program Files\Microsoft Visual Studio\2019\Community\VC\Tools\MSVC\14.29.30133\include\xstring(2858): here
2> instantiation of "std::basic_string<_Elem, _Traits, _Alloc> &std::basic_string<_Elem, _Traits, _Alloc>::assign(std::basic_string<_Elem, _Traits, _Alloc> &&) [with _Elem=char, _Traits=std::char_traits<char>, _Alloc=std::allocator<char>]"
2>D:\Program Files\Microsoft Visual Studio\2019\Community\VC\Tools\MSVC\14.29.30133\include\xlocnum(1274): here
2> instantiation of "_OutIt std::num_put<_Elem, _OutIt>::do_put(_OutIt, std::ios_base &, _Elem, __nv_bool) const [with _Elem=char, _OutIt=std::ostreambuf_iterator<char, std::char_traits<char>>]"
2>D:\Program Files\Microsoft Visual Studio\2019\Community\VC\Tools\MSVC\14.29.30133\include\xlocnum(1220): here
2> instantiation of "std::num_put<_Elem, _OutIt>::num_put(const std::_Locinfo &, size_t) [with _Elem=char, _OutIt=std::ostreambuf_iterator<char, std::char_traits<char>>]"
2>D:\Program Files\Microsoft Visual Studio\2019\Community\VC\Tools\MSVC\14.29.30133\include\xlocnum(1198): here
2> instantiation of "size_t std::num_put<_Elem, _OutIt>::_Getcat(const std::locale::facet **, const std::locale *) [with _Elem=char, _OutIt=std::ostreambuf_iterator<char, std::char_traits<char>>]"
2>D:\Program Files\Microsoft Visual Studio\2019\Community\VC\Tools\MSVC\14.29.30133\include\xlocale(438): here
2> instantiation of "const _Facet &std::use_facet<_Facet>(const std::locale &) [with _Facet=std::num_put<char, std::ostreambuf_iterator<char, std::char_traits<char>>>]"
2>D:\Program Files\Microsoft Visual Studio\2019\Community\VC\Tools\MSVC\14.29.30133\include\ostream(274): here
2> instantiation of "std::basic_ostream<_Elem, _Traits> &std::basic_ostream<_Elem, _Traits>::operator<<(int) [with _Elem=char, _Traits=std::char_traits<char>]"
2>E:\vcpkg\installed\x64-windows\include\opencv2/core/cvstd.inl.hpp(177): here
2>
2>D:\Program Files\Microsoft Visual Studio\2019\Community\VC\Tools\MSVC\14.29.30133\include\xutility(1309): error : expected a "("
2> detected during:
2> instantiation of "void std::_Adl_verify_range(const _Iter &, const _Sentinel &) [with _Iter=std::_String_iterator<std::_String_val<std::conditional_t<true, std::_Simple_types<char>, std::_String_iter_types<char, size_t, ptrdiff_t, char *, const char *, char &, const char &>>>>, _Sentinel=std::_String_iterator<std::_String_val<std::conditional_t<true, std::_Simple_types<char>, std::_String_iter_types<char, size_t, ptrdiff_t, char *, const char *, char &, const char &>>>>]"
2>D:\Program Files\Microsoft Visual Studio\2019\Community\VC\Tools\MSVC\14.29.30133\include\algorithm(2887): here
2> instantiation of "_OutIt std::transform(_InIt, _InIt, _OutIt, _Fn) [with _InIt=std::_String_iterator<std::_String_val<std::conditional_t<true, std::_Simple_types<char>, std::_String_iter_types<char, size_t, ptrdiff_t, char *, const char *, char &, const char &>>>>, _OutIt=std::_String_iterator<std::_String_val<std::conditional_t<true, std::_Simple_types<char>, std::_String_iter_types<char, size_t, ptrdiff_t, char *, const char *, char &, const char &>>>>, _Fn=char (*)(char)]"
2>E:\vcpkg\installed\x64-windows\include\opencv2/core/cvstd.hpp(174): here
2>
2>D:\Program Files\Microsoft Visual Studio\2019\Community\VC\Tools\MSVC\14.29.30133\include\xutility(1326): error : expected a "("
2> detected during:
2> instantiation of "decltype(auto) std::_Get_unwrapped(_Iter &&) [with _Iter=const std::_String_iterator<std::_String_val<std::conditional_t<true, std::_Simple_types<char>, std::_String_iter_types<char, size_t, ptrdiff_t, char *, const char *, char &, const char &>>>> &]"
2>D:\Program Files\Microsoft Visual Studio\2019\Community\VC\Tools\MSVC\14.29.30133\include\algorithm(2888): here
2> instantiation of "_OutIt std::transform(_InIt, _InIt, _OutIt, _Fn) [with _InIt=std::_String_iterator<std::_String_val<std::conditional_t<true, std::_Simple_types<char>, std::_String_iter_types<char, size_t, ptrdiff_t, char *, const char *, char &, const char &>>>>, _OutIt=std::_String_iterator<std::_String_val<std::conditional_t<true, std::_Simple_types<char>, std::_String_iter_types<char, size_t, ptrdiff_t, char *, const char *, char &, const char &>>>>, _Fn=char (*)(char)]"
2>E:\vcpkg\installed\x64-windows\include\opencv2/core/cvstd.hpp(174): here
2>
2>D:\Program Files\Microsoft Visual Studio\2019\Community\VC\Tools\MSVC\14.29.30133\include\xutility(1328): error : expected a "("
2> detected during:
2> instantiation of "decltype(auto) std::_Get_unwrapped(_Iter &&) [with _Iter=const std::_String_iterator<std::_String_val<std::conditional_t<true, std::_Simple_types<char>, std::_String_iter_types<char, size_t, ptrdiff_t, char *, const char *, char &, const char &>>>> &]"
2>D:\Program Files\Microsoft Visual Studio\2019\Community\VC\Tools\MSVC\14.29.30133\include\algorithm(2888): here
2> instantiation of "_OutIt std::transform(_InIt, _InIt, _OutIt, _Fn) [with _InIt=std::_String_iterator<std::_String_val<std::conditional_t<true, std::_Simple_types<char>, std::_String_iter_types<char, size_t, ptrdiff_t, char *, const char *, char &, const char &>>>>, _OutIt=std::_String_iterator<std::_String_val<std::conditional_t<true, std::_Simple_types<char>, std::_String_iter_types<char, size_t, ptrdiff_t, char *, const char *, char &, const char &>>>>, _Fn=char (*)(char)]"
2>E:\vcpkg\installed\x64-windows\include\opencv2/core/cvstd.hpp(174): here
2>
2>D:\Program Files\Microsoft Visual Studio\2019\Community\VC\Tools\MSVC\14.29.30133\include\xutility(1329): error : no suitable constructor exists to convert from "char *" to "std::_String_iterator<std::_String_val<std::conditional_t<true, std::_Simple_types<char>, std::_String_iter_types<char, size_t, ptrdiff_t, char *, const char *, char &, const char &>>>>"
2> detected during:
2> instantiation of "decltype(auto) std::_Get_unwrapped(_Iter &&) [with _Iter=const std::_String_iterator<std::_String_val<std::conditional_t<true, std::_Simple_types<char>, std::_String_iter_types<char, size_t, ptrdiff_t, char *, const char *, char &, const char &>>>> &]"
2>D:\Program Files\Microsoft Visual Studio\2019\Community\VC\Tools\MSVC\14.29.30133\include\algorithm(2888): here
2> instantiation of "_OutIt std::transform(_InIt, _InIt, _OutIt, _Fn) [with _InIt=std::_String_iterator<std::_String_val<std::conditional_t<true, std::_Simple_types<char>, std::_String_iter_types<char, size_t, ptrdiff_t, char *, const char *, char &, const char &>>>>, _OutIt=std::_String_iterator<std::_String_val<std::conditional_t<true, std::_Simple_types<char>, std::_String_iter_types<char, size_t, ptrdiff_t, char *, const char *, char &, const char &>>>>, _Fn=char (*)(char)]"
2>E:\vcpkg\installed\x64-windows\include\opencv2/core/cvstd.hpp(174): here
2>
2>D:\Program Files\Microsoft Visual Studio\2019\Community\VC\Tools\MSVC\14.29.30133\include\xutility(1478): error : expected a "("
2> detected during:
2> instantiation of "auto std::_Idl_distance<_Checked,_Iter>(const _Iter &, const _Iter &) [with _Checked=std::_String_iterator<std::_String_val<std::conditional_t<true, std::_Simple_types<char>, std::_String_iter_types<char, size_t, ptrdiff_t, char *, const char *, char &, const char &>>>>, _Iter=std::_String_iterator<std::_String_val<std::conditional_t<true, std::_Simple_types<char>, std::_String_iter_types<char, size_t, ptrdiff_t, char *, const char *, char &, const char &>>>>]"
2>D:\Program Files\Microsoft Visual Studio\2019\Community\VC\Tools\MSVC\14.29.30133\include\algorithm(2890): here
2> instantiation of "_OutIt std::transform(_InIt, _InIt, _OutIt, _Fn) [with _InIt=std::_String_iterator<std::_String_val<std::conditional_t<true, std::_Simple_types<char>, std::_String_iter_types<char, size_t, ptrdiff_t, char *, const char *, char &, const char &>>>>, _OutIt=std::_String_iterator<std::_String_val<std::conditional_t<true, std::_Simple_types<char>, std::_String_iter_types<char, size_t, ptrdiff_t, char *, const char *, char &, const char &>>>>, _Fn=char (*)(char)]"
2>E:\vcpkg\installed\x64-windows\include\opencv2/core/cvstd.hpp(174): here
2>
2>D:\Program Files\Microsoft Visual Studio\2019\Community\VC\Tools\MSVC\14.29.30133\include\xutility(1481): error : deduced return type "std::_Distance_unknown" conflicts with previously deduced type "std::_Iter_diff_t<std::_String_iterator<std::_String_val<std::conditional_t<true, std::_Simple_types<char>, std::_String_iter_types<char, size_t, ptrdiff_t, char *, const char *, char &, const char &>>>>>"
2> detected during:
2> instantiation of "auto std::_Idl_distance<_Checked,_Iter>(const _Iter &, const _Iter &) [with _Checked=std::_String_iterator<std::_String_val<std::conditional_t<true, std::_Simple_types<char>, std::_String_iter_types<char, size_t, ptrdiff_t, char *, const char *, char &, const char &>>>>, _Iter=std::_String_iterator<std::_String_val<std::conditional_t<true, std::_Simple_types<char>, std::_String_iter_types<char, size_t, ptrdiff_t, char *, const char *, char &, const char &>>>>]"
2>D:\Program Files\Microsoft Visual Studio\2019\Community\VC\Tools\MSVC\14.29.30133\include\algorithm(2890): here
2> instantiation of "_OutIt std::transform(_InIt, _InIt, _OutIt, _Fn) [with _InIt=std::_String_iterator<std::_String_val<std::conditional_t<true, std::_Simple_types<char>, std::_String_iter_types<char, size_t, ptrdiff_t, char *, const char *, char &, const char &>>>>, _OutIt=std::_String_iterator<std::_String_val<std::conditional_t<true, std::_Simple_types<char>, std::_String_iter_types<char, size_t, ptrdiff_t, char *, const char *, char &, const char &>>>>, _Fn=char (*)(char)]"
2>E:\vcpkg\installed\x64-windows\include\opencv2/core/cvstd.hpp(174): here
2>
2>D:\Program Files\Microsoft Visual Studio\2019\Community\VC\Tools\MSVC\14.29.30133\include\xmemory(948): error : expected a "("
2> detected during:
2> instantiation of "void std::_Destroy_range(std::_Alloc_ptr_t<_Alloc>, std::_Alloc_ptr_t<_Alloc>, _Alloc &) [with _Alloc=std::_Rebind_alloc_t<std::allocator<int>, int>]"
2>D:\Program Files\Microsoft Visual Studio\2019\Community\VC\Tools\MSVC\14.29.30133\include\vector(1680): here
2> instantiation of "void std::vector<_Ty, _Alloc>::_Destroy(std::vector<_Ty, _Alloc>::pointer, std::vector<_Ty, _Alloc>::pointer) [with _Ty=int, _Alloc=std::allocator<int>]"
2>D:\Program Files\Microsoft Visual Studio\2019\Community\VC\Tools\MSVC\14.29.30133\include\vector(1764): here
2> instantiation of "void std::vector<_Ty, _Alloc>::_Tidy() [with _Ty=int, _Alloc=std::allocator<int>]"
2>D:\Program Files\Microsoft Visual Studio\2019\Community\VC\Tools\MSVC\14.29.30133\include\vector(712): here
2> instantiation of "std::vector<_Ty, _Alloc>::~vector() [with _Ty=int, _Alloc=std::allocator<int>]"
2>E:\vcpkg\installed\x64-windows\include\opencv2/core/persistence.hpp(738): here
2> instantiation of "void cv::read(const cv::FileNode &, cv::Point_<_Tp> &, const cv::Point_<_Tp> &) [with _Tp=int]"
2>E:\vcpkg\installed\x64-windows\include\opencv2/core/persistence.hpp(795): here
2>
2>D:\Program Files\Microsoft Visual Studio\2019\Community\VC\Tools\MSVC\14.29.30133\include\xmemory(1818): error : expected a "("
2> detected during:
2> instantiation of "std::_Alloc_ptr_t<_Alloc> std::_Uninitialized_value_construct_n(std::_Alloc_ptr_t<_Alloc>, std::_Alloc_size_t<_Alloc>, _Alloc &) [with _Alloc=std::_Rebind_alloc_t<std::allocator<int>, int>]"
2>D:\Program Files\Microsoft Visual Studio\2019\Community\VC\Tools\MSVC\14.29.30133\include\vector(1648): here
2> instantiation of "std::vector<_Ty, _Alloc>::pointer std::vector<_Ty, _Alloc>::_Ufill(std::vector<_Ty, _Alloc>::pointer, std::vector<_Ty, _Alloc>::size_type, std::_Value_init_tag) [with _Ty=int, _Alloc=std::allocator<int>]"
2>D:\Program Files\Microsoft Visual Studio\2019\Community\VC\Tools\MSVC\14.29.30133\include\vector(1246): here
2> instantiation of "void std::vector<_Ty, _Alloc>::_Resize_reallocate(std::vector<_Ty, _Alloc>::size_type, const _Ty2 &) [with _Ty=int, _Alloc=std::allocator<int>, _Ty2=std::_Value_init_tag]"
2>D:\Program Files\Microsoft Visual Studio\2019\Community\VC\Tools\MSVC\14.29.30133\include\vector(1275): here
2> instantiation of "void std::vector<_Ty, _Alloc>::_Resize(std::vector<_Ty, _Alloc>::size_type, const _Ty2 &) [with _Ty=int, _Alloc=std::allocator<int>, _Ty2=std::_Value_init_tag]"
2>D:\Program Files\Microsoft Visual Studio\2019\Community\VC\Tools\MSVC\14.29.30133\include\vector(1290): here
2> instantiation of "void std::vector<_Ty, _Alloc>::resize(std::vector<_Ty, _Alloc>::size_type) [with _Ty=int, _Alloc=std::allocator<int>]"
2>E:\vcpkg\installed\x64-windows\include\opencv2/core/persistence.hpp(876): here
2> instantiation of "void cv::internal::VecReaderProxy<_Tp, 1>::operator()(std::vector<_Tp, std::allocator<_Tp>> &, size_t) const [with _Tp=int]"
2>E:\vcpkg\installed\x64-windows\include\opencv2/core/persistence.hpp(1267): here
2> instantiation of "cv::FileNodeIterator &cv::operator>>(cv::FileNodeIterator &, std::vector<_Tp, std::allocator<_Tp>> &) [with _Tp=int]"
2>E:\vcpkg\installed\x64-windows\include\opencv2/core/persistence.hpp(738): here
2> instantiation of "void cv::read(const cv::FileNode &, cv::Point_<_Tp> &, const cv::Point_<_Tp> &) [with _Tp=int]"
2>E:\vcpkg\installed\x64-windows\include\opencv2/core/persistence.hpp(795): here
2>
2>D:\Program Files\Microsoft Visual Studio\2019\Community\VC\Tools\MSVC\14.29.30133\include\xutility(131): error : expected a "("
2> detected during:
2> instantiation of "void *std::_Voidify_iter(_Iter) [with _Iter=int *]"
2>D:\Program Files\Microsoft Visual Studio\2019\Community\VC\Tools\MSVC\14.29.30133\include\xmemory(714): here
2> instantiation of "void std::_Default_allocator_traits<_Alloc>::construct(_Alloc &, _Objty *, _Types &&...) [with _Alloc=std::allocator<int>, _Objty=int, _Types=<>]"
2>D:\Program Files\Microsoft Visual Studio\2019\Community\VC\Tools\MSVC\14.29.30133\include\xmemory(1631): here
2> instantiation of "void std::_Uninitialized_backout_al<_Alloc>::_Emplace_back(_Types &&...) [with _Alloc=std::_Rebind_alloc_t<std::allocator<int>, int>, _Types=<>]"
2>D:\Program Files\Microsoft Visual Studio\2019\Community\VC\Tools\MSVC\14.29.30133\include\xmemory(1831): here
2> instantiation of "std::_Alloc_ptr_t<_Alloc> std::_Uninitialized_value_construct_n(std::_Alloc_ptr_t<_Alloc>, std::_Alloc_size_t<_Alloc>, _Alloc &) [with _Alloc=std::_Rebind_alloc_t<std::allocator<int>, int>]"
2>D:\Program Files\Microsoft Visual Studio\2019\Community\VC\Tools\MSVC\14.29.30133\include\vector(1648): here
2> instantiation of "std::vector<_Ty, _Alloc>::pointer std::vector<_Ty, _Alloc>::_Ufill(std::vector<_Ty, _Alloc>::pointer, std::vector<_Ty, _Alloc>::size_type, std::_Value_init_tag) [with _Ty=int, _Alloc=std::allocator<int>]"
2>D:\Program Files\Microsoft Visual Studio\2019\Community\VC\Tools\MSVC\14.29.30133\include\vector(1246): here
2> instantiation of "void std::vector<_Ty, _Alloc>::_Resize_reallocate(std::vector<_Ty, _Alloc>::size_type, const _Ty2 &) [with _Ty=int, _Alloc=std::allocator<int>, _Ty2=std::_Value_init_tag]"
2>D:\Program Files\Microsoft Visual Studio\2019\Community\VC\Tools\MSVC\14.29.30133\include\vector(1275): here
2> instantiation of "void std::vector<_Ty, _Alloc>::_Resize(std::vector<_Ty, _Alloc>::size_type, const _Ty2 &) [with _Ty=int, _Alloc=std::allocator<int>, _Ty2=std::_Value_init_tag]"
2>D:\Program Files\Microsoft Visual Studio\2019\Community\VC\Tools\MSVC\14.29.30133\include\vector(1290): here
2> instantiation of "void std::vector<_Ty, _Alloc>::resize(std::vector<_Ty, _Alloc>::size_type) [with _Ty=int, _Alloc=std::allocator<int>]"
2>E:\vcpkg\installed\x64-windows\include\opencv2/core/persistence.hpp(876): here
2> instantiation of "void cv::internal::VecReaderProxy<_Tp, 1>::operator()(std::vector<_Tp, std::allocator<_Tp>> &, size_t) const [with _Tp=int]"
2>E:\vcpkg\installed\x64-windows\include\opencv2/core/persistence.hpp(1267): here
2> instantiation of "cv::FileNodeIterator &cv::operator>>(cv::FileNodeIterator &, std::vector<_Tp, std::allocator<_Tp>> &) [with _Tp=int]"
2>E:\vcpkg\installed\x64-windows\include\opencv2/core/persistence.hpp(738): here
2> instantiation of "void cv::read(const cv::FileNode &, cv::Point_<_Tp> &, const cv::Point_<_Tp> &) [with _Tp=int]"
2>E:\vcpkg\installed\x64-windows\include\opencv2/core/persistence.hpp(795): here
2>
2>D:\Program Files\Microsoft Visual Studio\2019\Community\VC\Tools\MSVC\14.29.30133\include\xutility(1326): error : expected a "("
2> detected during:
2> instantiation of "decltype(auto) std::_Get_unwrapped(_Iter &&) [with _Iter=int *const &]"
2>D:\Program Files\Microsoft Visual Studio\2019\Community\VC\Tools\MSVC\14.29.30133\include\xmemory(1717): here
2> instantiation of "std::_Alloc_ptr_t<_Alloc> std::_Uninitialized_move(_InIt, _InIt, std::_Alloc_ptr_t<_Alloc>, _Alloc &) [with _InIt=int *, _Alloc=std::_Rebind_alloc_t<std::allocator<int>, int>]"
2>D:\Program Files\Microsoft Visual Studio\2019\Community\VC\Tools\MSVC\14.29.30133\include\vector(1664): here
2> instantiation of "void std::vector<_Ty, _Alloc>::_Umove_if_noexcept1(std::vector<_Ty, _Alloc>::pointer, std::vector<_Ty, _Alloc>::pointer, std::vector<_Ty, _Alloc>::pointer, std::true_type) [with _Ty=int, _Alloc=std::allocator<int>]"
2>D:\Program Files\Microsoft Visual Studio\2019\Community\VC\Tools\MSVC\14.29.30133\include\vector(1675): here
2> instantiation of "void std::vector<_Ty, _Alloc>::_Umove_if_noexcept(std::vector<_Ty, _Alloc>::pointer, std::vector<_Ty, _Alloc>::pointer, std::vector<_Ty, _Alloc>::pointer) [with _Ty=int, _Alloc=std::allocator<int>]"
2>D:\Program Files\Microsoft Visual Studio\2019\Community\VC\Tools\MSVC\14.29.30133\include\vector(1247): here
2> instantiation of "void std::vector<_Ty, _Alloc>::_Resize_reallocate(std::vector<_Ty, _Alloc>::size_type, const _Ty2 &) [with _Ty=int, _Alloc=std::allocator<int>, _Ty2=std::_Value_init_tag]"
2>D:\Program Files\Microsoft Visual Studio\2019\Community\VC\Tools\MSVC\14.29.30133\include\vector(1275): here
2> instantiation of "void std::vector<_Ty, _Alloc>::_Resize(std::vector<_Ty, _Alloc>::size_type, const _Ty2 &) [with _Ty=int, _Alloc=std::allocator<int>, _Ty2=std::_Value_init_tag]"
2>D:\Program Files\Microsoft Visual Studio\2019\Community\VC\Tools\MSVC\14.29.30133\include\vector(1290): here
2> instantiation of "void std::vector<_Ty, _Alloc>::resize(std::vector<_Ty, _Alloc>::size_type) [with _Ty=int, _Alloc=std::allocator<int>]"
2>E:\vcpkg\installed\x64-windows\include\opencv2/core/persistence.hpp(876): here
2> instantiation of "void cv::internal::VecReaderProxy<_Tp, 1>::operator()(std::vector<_Tp, std::allocator<_Tp>> &, size_t) const [with _Tp=int]"
2>E:\vcpkg\installed\x64-windows\include\opencv2/core/persistence.hpp(1267): here
2> instantiation of "cv::FileNodeIterator &cv::operator>>(cv::FileNodeIterator &, std::vector<_Tp, std::allocator<_Tp>> &) [with _Tp=int]"
2>E:\vcpkg\installed\x64-windows\include\opencv2/core/persistence.hpp(738): here
2> instantiation of "void cv::read(const cv::FileNode &, cv::Point_<_Tp> &, const cv::Point_<_Tp> &) [with _Tp=int]"
2>E:\vcpkg\installed\x64-windows\include\opencv2/core/persistence.hpp(795): here
2>
2>D:\Program Files\Microsoft Visual Studio\2019\Community\VC\Tools\MSVC\14.29.30133\include\xutility(1328): error : expected a "("
2> detected during:
2> instantiation of "decltype(auto) std::_Get_unwrapped(_Iter &&) [with _Iter=int *const &]"
2>D:\Program Files\Microsoft Visual Studio\2019\Community\VC\Tools\MSVC\14.29.30133\include\xmemory(1717): here
2> instantiation of "std::_Alloc_ptr_t<_Alloc> std::_Uninitialized_move(_InIt, _InIt, std::_Alloc_ptr_t<_Alloc>, _Alloc &) [with _InIt=int *, _Alloc=std::_Rebind_alloc_t<std::allocator<int>, int>]"
2>D:\Program Files\Microsoft Visual Studio\2019\Community\VC\Tools\MSVC\14.29.30133\include\vector(1664): here
2> instantiation of "void std::vector<_Ty, _Alloc>::_Umove_if_noexcept1(std::vector<_Ty, _Alloc>::pointer, std::vector<_Ty, _Alloc>::pointer, std::vector<_Ty, _Alloc>::pointer, std::true_type) [with _Ty=int, _Alloc=std::allocator<int>]"
2>D:\Program Files\Microsoft Visual Studio\2019\Community\VC\Tools\MSVC\14.29.30133\include\vector(1675): here
2> instantiation of "void std::vector<_Ty, _Alloc>::_Umove_if_noexcept(std::vector<_Ty, _Alloc>::pointer, std::vector<_Ty, _Alloc>::pointer, std::vector<_Ty, _Alloc>::pointer) [with _Ty=int, _Alloc=std::allocator<int>]"
2>D:\Program Files\Microsoft Visual Studio\2019\Community\VC\Tools\MSVC\14.29.30133\include\vector(1247): here
2> instantiation of "void std::vector<_Ty, _Alloc>::_Resize_reallocate(std::vector<_Ty, _Alloc>::size_type, const _Ty2 &) [with _Ty=int, _Alloc=std::allocator<int>, _Ty2=std::_Value_init_tag]"
2>D:\Program Files\Microsoft Visual Studio\2019\Community\VC\Tools\MSVC\14.29.30133\include\vector(1275): here
2> instantiation of "void std::vector<_Ty, _Alloc>::_Resize(std::vector<_Ty, _Alloc>::size_type, const _Ty2 &) [with _Ty=int, _Alloc=std::allocator<int>, _Ty2=std::_Value_init_tag]"
2>D:\Program Files\Microsoft Visual Studio\2019\Community\VC\Tools\MSVC\14.29.30133\include\vector(1290): here
2> instantiation of "void std::vector<_Ty, _Alloc>::resize(std::vector<_Ty, _Alloc>::size_type) [with _Ty=int, _Alloc=std::allocator<int>]"
2>E:\vcpkg\installed\x64-windows\include\opencv2/core/persistence.hpp(876): here
2> instantiation of "void cv::internal::VecReaderProxy<_Tp, 1>::operator()(std::vector<_Tp, std::allocator<_Tp>> &, size_t) const [with _Tp=int]"
2>E:\vcpkg\installed\x64-windows\include\opencv2/core/persistence.hpp(1267): here
2> instantiation of "cv::FileNodeIterator &cv::operator>>(cv::FileNodeIterator &, std::vector<_Tp, std::allocator<_Tp>> &) [with _Tp=int]"
2>E:\vcpkg\installed\x64-windows\include\opencv2/core/persistence.hpp(738): here
2> instantiation of "void cv::read(const cv::FileNode &, cv::Point_<_Tp> &, const cv::Point_<_Tp> &) [with _Tp=int]"
2>E:\vcpkg\installed\x64-windows\include\opencv2/core/persistence.hpp(795): here
2>
2>D:\Program Files\Microsoft Visual Studio\2019\Community\VC\Tools\MSVC\14.29.30133\include\xutility(1329): error : expression must have class type
2> detected during:
2> instantiation of "decltype(auto) std::_Get_unwrapped(_Iter &&) [with _Iter=int *const &]"
2>D:\Program Files\Microsoft Visual Studio\2019\Community\VC\Tools\MSVC\14.29.30133\include\xmemory(1717): here
2> instantiation of "std::_Alloc_ptr_t<_Alloc> std::_Uninitialized_move(_InIt, _InIt, std::_Alloc_ptr_t<_Alloc>, _Alloc &) [with _InIt=int *, _Alloc=std::_Rebind_alloc_t<std::allocator<int>, int>]"
2>D:\Program Files\Microsoft Visual Studio\2019\Community\VC\Tools\MSVC\14.29.30133\include\vector(1664): here
2> instantiation of "void std::vector<_Ty, _Alloc>::_Umove_if_noexcept1(std::vector<_Ty, _Alloc>::pointer, std::vector<_Ty, _Alloc>::pointer, std::vector<_Ty, _Alloc>::pointer, std::true_type) [with _Ty=int, _Alloc=std::allocator<int>]"
2>D:\Program Files\Microsoft Visual Studio\2019\Community\VC\Tools\MSVC\14.29.30133\include\vector(1675): here
2> instantiation of "void std::vector<_Ty, _Alloc>::_Umove_if_noexcept(std::vector<_Ty, _Alloc>::pointer, std::vector<_Ty, _Alloc>::pointer, std::vector<_Ty, _Alloc>::pointer) [with _Ty=int, _Alloc=std::allocator<int>]"
2>D:\Program Files\Microsoft Visual Studio\2019\Community\VC\Tools\MSVC\14.29.30133\include\vector(1247): here
2> instantiation of "void std::vector<_Ty, _Alloc>::_Resize_reallocate(std::vector<_Ty, _Alloc>::size_type, const _Ty2 &) [with _Ty=int, _Alloc=std::allocator<int>, _Ty2=std::_Value_init_tag]"
2>D:\Program Files\Microsoft Visual Studio\2019\Community\VC\Tools\MSVC\14.29.30133\include\vector(1275): here
2> instantiation of "void std::vector<_Ty, _Alloc>::_Resize(std::vector<_Ty, _Alloc>::size_type, const _Ty2 &) [with _Ty=int, _Alloc=std::allocator<int>, _Ty2=std::_Value_init_tag]"
2>D:\Program Files\Microsoft Visual Studio\2019\Community\VC\Tools\MSVC\14.29.30133\include\vector(1290): here
2> instantiation of "void std::vector<_Ty, _Alloc>::resize(std::vector<_Ty, _Alloc>::size_type) [with _Ty=int, _Alloc=std::allocator<int>]"
2>E:\vcpkg\installed\x64-windows\include\opencv2/core/persistence.hpp(876): here
2> instantiation of "void cv::internal::VecReaderProxy<_Tp, 1>::operator()(std::vector<_Tp, std::allocator<_Tp>> &, size_t) const [with _Tp=int]"
2>E:\vcpkg\installed\x64-windows\include\opencv2/core/persistence.hpp(1267): here
2> instantiation of "cv::FileNodeIterator &cv::operator>>(cv::FileNodeIterator &, std::vector<_Tp, std::allocator<_Tp>> &) [with _Tp=int]"
2>E:\vcpkg\installed\x64-windows\include\opencv2/core/persistence.hpp(738): here
2> instantiation of "void cv::read(const cv::FileNode &, cv::Point_<_Tp> &, const cv::Point_<_Tp> &) [with _Tp=int]"
2>E:\vcpkg\installed\x64-windows\include\opencv2/core/persistence.hpp(795): here
2>
2>D:\Program Files\Microsoft Visual Studio\2019\Community\VC\Tools\MSVC\14.29.30133\include\xmemory(1719): error : expected a "("
2> detected during:
2> instantiation of "std::_Alloc_ptr_t<_Alloc> std::_Uninitialized_move(_InIt, _InIt, std::_Alloc_ptr_t<_Alloc>, _Alloc &) [with _InIt=int *, _Alloc=std::_Rebind_alloc_t<std::allocator<int>, int>]"
2>D:\Program Files\Microsoft Visual Studio\2019\Community\VC\Tools\MSVC\14.29.30133\include\vector(1664): here
2> instantiation of "void std::vector<_Ty, _Alloc>::_Umove_if_noexcept1(std::vector<_Ty, _Alloc>::pointer, std::vector<_Ty, _Alloc>::pointer, std::vector<_Ty, _Alloc>::pointer, std::true_type) [with _Ty=int, _Alloc=std::allocator<int>]"
2>D:\Program Files\Microsoft Visual Studio\2019\Community\VC\Tools\MSVC\14.29.30133\include\vector(1675): here
2> instantiation of "void std::vector<_Ty, _Alloc>::_Umove_if_noexcept(std::vector<_Ty, _Alloc>::pointer, std::vector<_Ty, _Alloc>::pointer, std::vector<_Ty, _Alloc>::pointer) [with _Ty=int, _Alloc=std::allocator<int>]"
2>D:\Program Files\Microsoft Visual Studio\2019\Community\VC\Tools\MSVC\14.29.30133\include\vector(1247): here
2> instantiation of "void std::vector<_Ty, _Alloc>::_Resize_reallocate(std::vector<_Ty, _Alloc>::size_type, const _Ty2 &) [with _Ty=int, _Alloc=std::allocator<int>, _Ty2=std::_Value_init_tag]"
2>D:\Program Files\Microsoft Visual Studio\2019\Community\VC\Tools\MSVC\14.29.30133\include\vector(1275): here
2> instantiation of "void std::vector<_Ty, _Alloc>::_Resize(std::vector<_Ty, _Alloc>::size_type, const _Ty2 &) [with _Ty=int, _Alloc=std::allocator<int>, _Ty2=std::_Value_init_tag]"
2>D:\Program Files\Microsoft Visual Studio\2019\Community\VC\Tools\MSVC\14.29.30133\include\vector(1290): here
2> instantiation of "void std::vector<_Ty, _Alloc>::resize(std::vector<_Ty, _Alloc>::size_type) [with _Ty=int, _Alloc=std::allocator<int>]"
2>E:\vcpkg\installed\x64-windows\include\opencv2/core/persistence.hpp(876): here
2> instantiation of "void cv::internal::VecReaderProxy<_Tp, 1>::operator()(std::vector<_Tp, std::allocator<_Tp>> &, size_t) const [with _Tp=int]"
2>E:\vcpkg\installed\x64-windows\include\opencv2/core/persistence.hpp(1267): here
2> instantiation of "cv::FileNodeIterator &cv::operator>>(cv::FileNodeIterator &, std::vector<_Tp, std::allocator<_Tp>> &) [with _Tp=int]"
2>E:\vcpkg\installed\x64-windows\include\opencv2/core/persistence.hpp(738): here
2> instantiation of "void cv::read(const cv::FileNode &, cv::Point_<_Tp> &, const cv::Point_<_Tp> &) [with _Tp=int]"
2>E:\vcpkg\installed\x64-windows\include\opencv2/core/persistence.hpp(795): here
2>
2>D:\Program Files\Microsoft Visual Studio\2019\Community\VC\Tools\MSVC\14.29.30133\include\xmemory(919): error : expected a "("
2> detected during:
2> instantiation of "void std::_Pocca(_Alloc &, const _Alloc &) [with _Alloc=std::_Rebind_alloc_t<std::allocator<cv::DMatch>, cv::DMatch>]"
2>D:\Program Files\Microsoft Visual Studio\2019\Community\VC\Tools\MSVC\14.29.30133\include\vector(1198): here
2> instantiation of "void std::vector<_Ty, _Alloc>::_Copy_assign(const std::vector<_Ty, _Alloc> &, std::false_type) [with _Ty=cv::DMatch, _Alloc=std::allocator<cv::DMatch>]"
2>D:\Program Files\Microsoft Visual Studio\2019\Community\VC\Tools\MSVC\14.29.30133\include\vector(1216): here
2> instantiation of "std::vector<_Ty, _Alloc> &std::vector<_Ty, _Alloc>::operator=(const std::vector<_Ty, _Alloc> &) [with _Ty=cv::DMatch, _Alloc=std::allocator<cv::DMatch>]"
2>E:\vcpkg\installed\x64-windows\include\opencv2/core/persistence.hpp(1206): here
2>
2>D:\Program Files\Microsoft Visual Studio\2019\Community\VC\Tools\MSVC\14.29.30133\include\xutility(1309): error : expected a "("
2> detected during:
2> instantiation of "void std::_Adl_verify_range(const _Iter &, const _Sentinel &) [with _Iter=cv::DMatch *, _Sentinel=cv::DMatch *]"
2>D:\Program Files\Microsoft Visual Studio\2019\Community\VC\Tools\MSVC\14.29.30133\include\vector(1188): here
2> instantiation of "void std::vector<_Ty, _Alloc>::assign(_Iter, _Iter) [with _Ty=cv::DMatch, _Alloc=std::allocator<cv::DMatch>, _Iter=cv::DMatch *, <unnamed>=0]"
2>D:\Program Files\Microsoft Visual Studio\2019\Community\VC\Tools\MSVC\14.29.30133\include\vector(1200): here
2> instantiation of "void std::vector<_Ty, _Alloc>::_Copy_assign(const std::vector<_Ty, _Alloc> &, std::false_type) [with _Ty=cv::DMatch, _Alloc=std::allocator<cv::DMatch>]"
2>D:\Program Files\Microsoft Visual Studio\2019\Community\VC\Tools\MSVC\14.29.30133\include\vector(1216): here
2> instantiation of "std::vector<_Ty, _Alloc> &std::vector<_Ty, _Alloc>::operator=(const std::vector<_Ty, _Alloc> &) [with _Ty=cv::DMatch, _Alloc=std::allocator<cv::DMatch>]"
2>E:\vcpkg\installed\x64-windows\include\opencv2/core/persistence.hpp(1206): here
2>
2>D:\Program Files\Microsoft Visual Studio\2019\Community\VC\Tools\MSVC\14.29.30133\include\xutility(1326): error : expected a "("
2> detected during:
2> instantiation of "decltype(auto) std::_Get_unwrapped(_Iter &&) [with _Iter=cv::DMatch *&]"
2>D:\Program Files\Microsoft Visual Studio\2019\Community\VC\Tools\MSVC\14.29.30133\include\vector(1189): here
2> instantiation of "void std::vector<_Ty, _Alloc>::assign(_Iter, _Iter) [with _Ty=cv::DMatch, _Alloc=std::allocator<cv::DMatch>, _Iter=cv::DMatch *, <unnamed>=0]"
2>D:\Program Files\Microsoft Visual Studio\2019\Community\VC\Tools\MSVC\14.29.30133\include\vector(1200): here
2> instantiation of "void std::vector<_Ty, _Alloc>::_Copy_assign(const std::vector<_Ty, _Alloc> &, std::false_type) [with _Ty=cv::DMatch, _Alloc=std::allocator<cv::DMatch>]"
2>D:\Program Files\Microsoft Visual Studio\2019\Community\VC\Tools\MSVC\14.29.30133\include\vector(1216): here
2> instantiation of "std::vector<_Ty, _Alloc> &std::vector<_Ty, _Alloc>::operator=(const std::vector<_Ty, _Alloc> &) [with _Ty=cv::DMatch, _Alloc=std::allocator<cv::DMatch>]"
2>E:\vcpkg\installed\x64-windows\include\opencv2/core/persistence.hpp(1206): here
2>
2>D:\Program Files\Microsoft Visual Studio\2019\Community\VC\Tools\MSVC\14.29.30133\include\xutility(1328): error : expected a "("
2> detected during:
2> instantiation of "decltype(auto) std::_Get_unwrapped(_Iter &&) [with _Iter=cv::DMatch *&]"
2>D:\Program Files\Microsoft Visual Studio\2019\Community\VC\Tools\MSVC\14.29.30133\include\vector(1189): here
2> instantiation of "void std::vector<_Ty, _Alloc>::assign(_Iter, _Iter) [with _Ty=cv::DMatch, _Alloc=std::allocator<cv::DMatch>, _Iter=cv::DMatch *, <unnamed>=0]"
2>D:\Program Files\Microsoft Visual Studio\2019\Community\VC\Tools\MSVC\14.29.30133\include\vector(1200): here
2> instantiation of "void std::vector<_Ty, _Alloc>::_Copy_assign(const std::vector<_Ty, _Alloc> &, std::false_type) [with _Ty=cv::DMatch, _Alloc=std::allocator<cv::DMatch>]"
2>D:\Program Files\Microsoft Visual Studio\2019\Community\VC\Tools\MSVC\14.29.30133\include\vector(1216): here
2> instantiation of "std::vector<_Ty, _Alloc> &std::vector<_Ty, _Alloc>::operator=(const std::vector<_Ty, _Alloc> &) [with _Ty=cv::DMatch, _Alloc=std::allocator<cv::DMatch>]"
2>E:\vcpkg\installed\x64-windows\include\opencv2/core/persistence.hpp(1206): here
2>
2>D:\Program Files\Microsoft Visual Studio\2019\Community\VC\Tools\MSVC\14.29.30133\include\xutility(1329): error : expression must have class type
2> detected during:
2> instantiation of "decltype(auto) std::_Get_unwrapped(_Iter &&) [with _Iter=cv::DMatch *&]"
2>D:\Program Files\Microsoft Visual Studio\2019\Community\VC\Tools\MSVC\14.29.30133\include\vector(1189): here
2> instantiation of "void std::vector<_Ty, _Alloc>::assign(_Iter, _Iter) [with _Ty=cv::DMatch, _Alloc=std::allocator<cv::DMatch>, _Iter=cv::DMatch *, <unnamed>=0]"
2>D:\Program Files\Microsoft Visual Studio\2019\Community\VC\Tools\MSVC\14.29.30133\include\vector(1200): here
2> instantiation of "void std::vector<_Ty, _Alloc>::_Copy_assign(const std::vector<_Ty, _Alloc> &, std::false_type) [with _Ty=cv::DMatch, _Alloc=std::allocator<cv::DMatch>]"
2>D:\Program Files\Microsoft Visual Studio\2019\Community\VC\Tools\MSVC\14.29.30133\include\vector(1216): here
2> instantiation of "std::vector<_Ty, _Alloc> &std::vector<_Ty, _Alloc>::operator=(const std::vector<_Ty, _Alloc> &) [with _Ty=cv::DMatch, _Alloc=std::allocator<cv::DMatch>]"
2>E:\vcpkg\installed\x64-windows\include\opencv2/core/persistence.hpp(1206): here
2>
2>D:\Program Files\Microsoft Visual Studio\2019\Community\VC\Tools\MSVC\14.29.30133\include\xmemory(919): error : expected a "("
2> detected during:
2> instantiation of "void std::_Pocca(_Alloc &, const _Alloc &) [with _Alloc=std::_Rebind_alloc_t<std::allocator<cv::KeyPoint>, cv::KeyPoint>]"
2>D:\Program Files\Microsoft Visual Studio\2019\Community\VC\Tools\MSVC\14.29.30133\include\vector(1198): here
2> instantiation of "void std::vector<_Ty, _Alloc>::_Copy_assign(const std::vector<_Ty, _Alloc> &, std::false_type) [with _Ty=cv::KeyPoint, _Alloc=std::allocator<cv::KeyPoint>]"
2>D:\Program Files\Microsoft Visual Studio\2019\Community\VC\Tools\MSVC\14.29.30133\include\vector(1216): here
2> instantiation of "std::vector<_Ty, _Alloc> &std::vector<_Ty, _Alloc>::operator=(const std::vector<_Ty, _Alloc> &) [with _Ty=cv::KeyPoint, _Alloc=std::allocator<cv::KeyPoint>]"
2>E:\vcpkg\installed\x64-windows\include\opencv2/core/persistence.hpp(1197): here
2>
2>D:\Program Files\Microsoft Visual Studio\2019\Community\VC\Tools\MSVC\14.29.30133\include\xutility(1309): error : expected a "("
2> detected during:
2> instantiation of "void std::_Adl_verify_range(const _Iter &, const _Sentinel &) [with _Iter=cv::KeyPoint *, _Sentinel=cv::KeyPoint *]"
2>D:\Program Files\Microsoft Visual Studio\2019\Community\VC\Tools\MSVC\14.29.30133\include\vector(1188): here
2> instantiation of "void std::vector<_Ty, _Alloc>::assign(_Iter, _Iter) [with _Ty=cv::KeyPoint, _Alloc=std::allocator<cv::KeyPoint>, _Iter=cv::KeyPoint *, <unnamed>=0]"
2>D:\Program Files\Microsoft Visual Studio\2019\Community\VC\Tools\MSVC\14.29.30133\include\vector(1200): here
2> instantiation of "void std::vector<_Ty, _Alloc>::_Copy_assign(const std::vector<_Ty, _Alloc> &, std::false_type) [with _Ty=cv::KeyPoint, _Alloc=std::allocator<cv::KeyPoint>]"
2>D:\Program Files\Microsoft Visual Studio\2019\Community\VC\Tools\MSVC\14.29.30133\include\vector(1216): here
2> instantiation of "std::vector<_Ty, _Alloc> &std::vector<_Ty, _Alloc>::operator=(const std::vector<_Ty, _Alloc> &) [with _Ty=cv::KeyPoint, _Alloc=std::allocator<cv::KeyPoint>]"
2>E:\vcpkg\installed\x64-windows\include\opencv2/core/persistence.hpp(1197): here
2>
2>D:\Program Files\Microsoft Visual Studio\2019\Community\VC\Tools\MSVC\14.29.30133\include\xutility(1326): error : expected a "("
2> detected during:
2> instantiation of "decltype(auto) std::_Get_unwrapped(_Iter &&) [with _Iter=cv::KeyPoint *&]"
2>D:\Program Files\Microsoft Visual Studio\2019\Community\VC\Tools\MSVC\14.29.30133\include\vector(1189): here
2> instantiation of "void std::vector<_Ty, _Alloc>::assign(_Iter, _Iter) [with _Ty=cv::KeyPoint, _Alloc=std::allocator<cv::KeyPoint>, _Iter=cv::KeyPoint *, <unnamed>=0]"
2>D:\Program Files\Microsoft Visual Studio\2019\Community\VC\Tools\MSVC\14.29.30133\include\vector(1200): here
2> instantiation of "void std::vector<_Ty, _Alloc>::_Copy_assign(const std::vector<_Ty, _Alloc> &, std::false_type) [with _Ty=cv::KeyPoint, _Alloc=std::allocator<cv::KeyPoint>]"
2>D:\Program Files\Microsoft Visual Studio\2019\Community\VC\Tools\MSVC\14.29.30133\include\vector(1216): here
2> instantiation of "std::vector<_Ty, _Alloc> &std::vector<_Ty, _Alloc>::operator=(const std::vector<_Ty, _Alloc> &) [with _Ty=cv::KeyPoint, _Alloc=std::allocator<cv::KeyPoint>]"
2>E:\vcpkg\installed\x64-windows\include\opencv2/core/persistence.hpp(1197): here
2>
2>D:\Program Files\Microsoft Visual Studio\2019\Community\VC\Tools\MSVC\14.29.30133\include\xutility(1328): error : expected a "("
2> detected during:
2> instantiation of "decltype(auto) std::_Get_unwrapped(_Iter &&) [with _Iter=cv::KeyPoint *&]"
2>D:\Program Files\Microsoft Visual Studio\2019\Community\VC\Tools\MSVC\14.29.30133\include\vector(1189): here
2> instantiation of "void std::vector<_Ty, _Alloc>::assign(_Iter, _Iter) [with _Ty=cv::KeyPoint, _Alloc=std::allocator<cv::KeyPoint>, _Iter=cv::KeyPoint *, <unnamed>=0]"
2>D:\Program Files\Microsoft Visual Studio\2019\Community\VC\Tools\MSVC\14.29.30133\include\vector(1200): here
2> instantiation of "void std::vector<_Ty, _Alloc>::_Copy_assign(const std::vector<_Ty, _Alloc> &, std::false_type) [with _Ty=cv::KeyPoint, _Alloc=std::allocator<cv::KeyPoint>]"
2>D:\Program Files\Microsoft Visual Studio\2019\Community\VC\Tools\MSVC\14.29.30133\include\vector(1216): here
2> instantiation of "std::vector<_Ty, _Alloc> &std::vector<_Ty, _Alloc>::operator=(const std::vector<_Ty, _Alloc> &) [with _Ty=cv::KeyPoint, _Alloc=std::allocator<cv::KeyPoint>]"
2>E:\vcpkg\installed\x64-windows\include\opencv2/core/persistence.hpp(1197): here
2>
2>D:\Program Files\Microsoft Visual Studio\2019\Community\VC\Tools\MSVC\14.29.30133\include\xutility(1329): error : expression must have class type
2> detected during:
2> instantiation of "decltype(auto) std::_Get_unwrapped(_Iter &&) [with _Iter=cv::KeyPoint *&]"
2>D:\Program Files\Microsoft Visual Studio\2019\Community\VC\Tools\MSVC\14.29.30133\include\vector(1189): here
2> instantiation of "void std::vector<_Ty, _Alloc>::assign(_Iter, _Iter) [with _Ty=cv::KeyPoint, _Alloc=std::allocator<cv::KeyPoint>, _Iter=cv::KeyPoint *, <unnamed>=0]"
2>D:\Program Files\Microsoft Visual Studio\2019\Community\VC\Tools\MSVC\14.29.30133\include\vector(1200): here
2> instantiation of "void std::vector<_Ty, _Alloc>::_Copy_assign(const std::vector<_Ty, _Alloc> &, std::false_type) [with _Ty=cv::KeyPoint, _Alloc=std::allocator<cv::KeyPoint>]"
2>D:\Program Files\Microsoft Visual Studio\2019\Community\VC\Tools\MSVC\14.29.30133\include\vector(1216): here
2> instantiation of "std::vector<_Ty, _Alloc> &std::vector<_Ty, _Alloc>::operator=(const std::vector<_Ty, _Alloc> &) [with _Ty=cv::KeyPoint, _Alloc=std::allocator<cv::KeyPoint>]"
2>E:\vcpkg\installed\x64-windows\include\opencv2/core/persistence.hpp(1197): here
2>
2>68 errors detected in the compilation of "D:/workspace/github/openMVS/libs/MVS/PatchMatchCUDA.cu".
2>CUDACOMPILE : nvcc warning : The 'compute_35', 'compute_37', 'compute_50', 'sm_35', 'sm_37' and 'sm_50' architectures are deprecated, and may be removed in a future release (Use -Wno-deprecated-gpu-targets to suppress warning).
2>PatchMatchCUDA.cu
2>D:\Program Files\Microsoft Visual Studio\2019\Community\MSBuild\Microsoft\VC\v160\BuildCustomizations\CUDA 11.1.targets(785,9): error MSB3721: 命令“"C:\Program Files\NVIDIA GPU Computing Toolkit\CUDA\v11.1\bin\nvcc.exe" -gencode=arch=compute_50,code=\"compute_50,compute_50\" -gencode=arch=compute_50,code=\"sm_50,compute_50\" -gencode=arch=compute_72,code=\"compute_72,compute_72\" -gencode=arch=compute_72,code=\"sm_72,compute_72\" -gencode=arch=compute_75,code=\"compute_75,compute_75\" -gencode=arch=compute_75,code=\"sm_75,compute_75\" --use-local-env -ccbin "D:\Program Files\Microsoft Visual Studio\2019\Community\VC\Tools\MSVC\14.29.30133\bin\HostX64\x64" -x cu -I"C:\Program Files\NVIDIA GPU Computing Toolkit\CUDA\v11.1\include" -I"E:\vcpkg\installed\x64-windows\include\eigen3" -ID:\workspace\github\openMVS -I"D:\workspace\github\openMVS-build" -I"E:\vcpkg\installed\x64-windows\share\vcglib" -I"E:\vcpkg\installed\x64-windows\include" -I"E:\vcpkg\installed\x64-windows\share\cgal\..\..\include" -I"C:\Program Files\NVIDIA GPU Computing Toolkit\CUDA\v11.1\include" --keep-dir x64\Debug -maxrregcount=0 --machine 64 --compile -cudart static --expt-relaxed-constexpr -std=c++14 -Xcompiler="/EHsc -Zi -Ob0" -g -D_WINDOWS -D_SCL_SECURE_NO_DEPRECATE -D_SCL_SECURE_NO_WARNINGS -D_LIB -D_USE_OPENMP -D_USE_OPENGL -D_USE_CUDA -D_USE_BOOST -D_USE_EIGEN -D_USE_NONFREE -D_USE_FAST_FLOAT2INT -D_USE_FAST_CBRT -D_USE_SSE -D"CMAKE_INTDIR=\"Debug\"" -D_MBCS -DWIN32 -D_WINDOWS -D_CRT_SECURE_NO_DEPRECATE -D_CRT_NONSTDC_NO_DEPRECATE -D_SCL_SECURE_NO_WARNINGS -D_SCL_SECURE_NO_DEPRECATE -D_LIB -D_USE_OPENMP -D_USE_OPENGL -D_USE_CUDA -D_USE_BOOST -D_USE_EIGEN -D_USE_NONFREE -D_USE_FAST_FLOAT2INT -D_USE_FAST_CBRT -D_USE_SSE -D"CMAKE_INTDIR=\"Debug\"" -Xcompiler "/EHsc /W3 /nologo /Od /FdD:\workspace\github\openMVS-build\lib\vc16\x64\Debug\MVS.pdb /FS /Zi /RTC1 /MDd /GR" -o MVS.dir\Debug\/PatchMatchCUDA.cu.obj "D:\workspace\github\openMVS\libs\MVS\PatchMatchCUDA.cu"”已退出,返回代码为 1。
2>已完成生成项目“MVS.vcxproj”的操作 - 失败。
```
04 / LABELS
Labels from the report text only; not yet run
No supported category has been assigned.
Label rules and the text that matched
[]