Build Failure With Maven 3.8.5
envgap__OpenFeign__feign-1833
01 / FAILURE SIGNATURE
As reported upstream
[ERROR] Failed to execute goal io.sundr:sundr-maven-plugin:0.40.1:generate-bom (default) on project parent: Error building generated bom:feign-bom: Could not create ReactorContext. org.apache.maven.session.scope.internal.SessionScope.memento() -> [Help 1]
Not a benchmark task.
- In a clean container the reported failure did not reproduce, or the known fix did not make the project run.
02 / ENVIRONMENT RECIPE
- Base commit
06e53497a2ae19c1478ce98d75aa274e4195bd6f- Manifest
pom.xml- Reproduce
Awaiting issue-specific recipe- Run under trace
Awaiting a meaningful runtime command
03 / ORIGINAL ISSUE TEXT
OpenFeign/feign #1833 · read the original issue
I'm getting a build failure after updating to a newer version of maven that came with fedora 37. ``` [ERROR] Failed to execute goal io.sundr:sundr-maven-plugin:0.40.1:generate-bom (default) on project parent: Error building generated bom:feign-bom: Could not create ReactorContext. org.apache.maven.session.scope.internal.SessionScope.memento() -> [Help 1] ``` ``` mvn -version Apache Maven 3.8.5 (Red Hat 3.8.5-3) Maven home: /usr/share/maven Java version: 11.0.17-ea, vendor: Red Hat, Inc., runtime: /usr/lib/jvm/java-11-openjdk-11.0.17.0.1-0.1.ea.fc37.x86_64 Default locale: en_US, platform encoding: UTF-8 OS name: "linux", version: "6.0.7-301.fc37.x86_64", arch: "amd64", family: "unix" ``` Does not fail if using the mvn wrapper: ``` ./mvnw -version Apache Maven 3.5.4 (1edded0938998edf8bf061f1ceb3cfdeccf443fe; 2018-06-17T12:33:14-06:00) Maven home: /home/jkomoroski/.m2/wrapper/dists/apache-maven-3.5.4-bin/jl1qqhdeineh9qg83dtj7i91c/apache-maven-3.5.4 Java version: 11.0.17-ea, vendor: Red Hat, Inc., runtime: /usr/lib/jvm/java-11-openjdk-11.0.17.0.1-0.1.ea.fc37.x86_64 Default locale: en_US, platform encoding: UTF-8 OS name: "linux", version: "6.0.7-301.fc37.x86_64", arch: "amd64", family: "unix" ``` It seems to me that ` io.sundr:sundr-maven-plugin:0.40.1` is very out of date.
04 / LABELS
Labels from the report text only; not yet run
No supported category has been assigned.
Label rules and the text that matched
[]