← All tasks
javascriptkelektiv/node.bcrypt.js #648Not a task: not reproduced

Bcrypt@3.0.0 failed to install on Node 8.11.4

envgap__kelektiv__node.bcrypt.js-648

01 / FAILURE SIGNATURE

As reported upstream

npm ERR! bcrypt@3.0.0 install: `node-pre-gyp install --fallback-to-build`
Not a benchmark task.
  • In a clean container the reported failure did not reproduce, or the known fix did not make the project run.

02 / ENVIRONMENT RECIPE

Base commit
d32a1a64f381d6290a9df6277bb0f0760c3fa0e7
Manifest
package.json
Reproduce
Awaiting issue-specific recipe
Run under trace
Awaiting a meaningful runtime command

03 / ORIGINAL ISSUE TEXT

kelektiv/node.bcrypt.js #648 · read the original issue
While trying to install bcrypt on Ubuntu 16, with Node 8.11.4 running, returns following error



npm ERR! code ELIFECYCLE

npm ERR! errno 1

npm ERR! bcrypt@3.0.0 install: `node-pre-gyp install --fallback-to-build`

npm ERR! Exit status 1

npm ERR!

npm ERR! Failed at the bcrypt@3.0.0 install script.

npm ERR! This is probably not a problem with npm. There is likely additional logging output above.



Thanks!

Continue on GitHub ↗

04 / LABELS

Labels from the report text only; not yet run

No supported category has been assigned.

Label rules and the text that matched
[]