Update to surefire/failsafe 3.0.0-M5+
envgap__openzipkin__zipkin-3159
01 / FAILURE SIGNATURE
As reported upstream
[ERROR] Failed to execute goal org.apache.maven.plugins:maven-failsafe-plugin:3.0.0-M5:verify (verify) on project zipkin-tests: There are test failures.
Not a benchmark task.
- In a clean container the reported failure did not reproduce, or the known fix did not make the project run.
02 / ENVIRONMENT RECIPE
- Base commit
bac3ec9a23b03507871f2becdf2d34ed017031a5- Manifest
pom.xml- Reproduce
Awaiting issue-specific recipe- Run under trace
Awaiting a meaningful runtime command
03 / ORIGINAL ISSUE TEXT
openzipkin/zipkin #3159 · read the original issue
We are blocked updating until we figure out why this failure happens. Incidentally, zipkin-tests has `ITInMemoryStorage` which is a jupiter test! ``` [ERROR] Failed to execute goal org.apache.maven.plugins:maven-failsafe-plugin:3.0.0-M5:verify (verify) on project zipkin-tests: There are test failures. [ERROR] [ERROR] Please refer to /Users/adriancole/oss/scratch/zipkin/zipkin-tests/target/failsafe-reports for the individual test results. [ERROR] Please refer to dump files (if any exist) [date].dump, [date]-jvmRun[N].dump and [date].dumpstream. [ERROR] org.apache.maven.surefire.booter.SurefireBooterForkException: There was an error in the forked process [ERROR] TestEngine with ID 'junit-jupiter' failed to discover tests [ERROR] at org.apache.maven.plugin.surefire.booterclient.ForkStarter.fork(ForkStarter.java:733) [ERROR] at org.apache.maven.plugin.surefire.booterclient.ForkStarter.run(ForkStarter.java:305) [ERROR] at org.apache.maven.plugin.surefire.booterclient.ForkStarter.run(ForkStarter.java:265) [ERROR] at org.apache.maven.plugin.surefire.AbstractSurefireMojo.executeProvider(AbstractSurefireMojo.java:1314) [ERROR] at org.apache.maven.plugin.surefire.AbstractSurefireMojo.executeAfterPreconditionsChecked(AbstractSurefireMojo.java:1159) [ERROR] at org.apache.maven.plugin.surefire.AbstractSurefireMojo.execute(AbstractSurefireMojo.java:932) [ERROR] at org.apache.maven.plugin.DefaultBuildPluginManager.executeMojo(DefaultBuildPluginManager.java:137) [ERROR] at org.apache.maven.lifecycle.internal.MojoExecutor.execute(MojoExecutor.java:210) [ERROR] at org.apache.maven.lifecycle.internal.MojoExecutor.execute(MojoExecutor.java:156) [ERROR] at org.apache.maven.lifecycle.internal.MojoExecutor.execute(MojoExecutor.java:148) [ERROR] at org.apache.maven.lifecycle.internal.LifecycleModuleBuilder.buildProject(LifecycleModuleBuilder.java:117) [ERROR] at org.apache.maven.lifecycle.internal.LifecycleModuleBuilder.buildProject(LifecycleModuleBuilder.java:81) [ERROR] at org.apache.maven.lifecycle.internal.builder.singlethreaded.SingleThreadedBuilder.build(SingleThreadedBuilder.java:56) [ERROR] at org.apache.maven.lifecycle.internal.LifecycleStarter.execute(LifecycleStarter.java:128) [ERROR] at org.apache.maven.DefaultMaven.doExecute(DefaultMaven.java:305) [ERROR] at org.apache.maven.DefaultMaven.doExecute(DefaultMaven.java:192) [ERROR] at org.apache.maven.DefaultMaven.execute(DefaultMaven.java:105) [ERROR] at org.apache.maven.cli.MavenCli.execute(MavenCli.java:957) [ERROR] at org.apache.maven.cli.MavenCli.doMain(MavenCli.java:289) [ERROR] at org.apache.maven.cli.MavenCli.main(MavenCli.java:193) [ERROR] at java.base/jdk.internal.reflect.NativeMethodAccessorImpl.invoke0(Native Method) [ERROR] at java.base/jdk.internal.reflect.NativeMethodAccessorImpl.invoke(NativeMethodAccessorImpl.java:62) [ERROR] at java.base/jdk.internal.reflect.DelegatingMethodAccessorImpl.invoke(DelegatingMethodAccessorImpl.java:43) [ERROR] at java.base/java.lang.reflect.Method.invoke(Method.java:567) [ERROR] at org.codehaus.plexus.classworlds.launcher.Launcher.launchEnhanced(Launcher.java:282) [ERROR] at org.codehaus.plexus.classworlds.launcher.Launcher.launch(Launcher.java:225) [ERROR] at org.codehaus.plexus.classworlds.launcher.Launcher.mainWithExitCode(Launcher.java:406) [ERROR] at org.codehaus.plexus.classworlds.launcher.Launcher.main(Launcher.java:347) [ERROR] at java.base/jdk.internal.reflect.NativeMethodAccessorImpl.invoke0(Native Method) [ERROR] at java.base/jdk.internal.reflect.NativeMethodAccessorImpl.invoke(NativeMethodAccessorImpl.java:62) [ERROR] at java.base/jdk.internal.reflect.DelegatingMethodAccessorImpl.invoke(DelegatingMethodAccessorImpl.java:43) [ERROR] at java.base/java.lang.reflect.Method.invoke(Method.java:567) [ERROR] at org.apache.maven.wrapper.BootstrapMainStarter.start(BootstrapMainStarter.java:39) [ERROR] at org.apache.maven.wrapper.WrapperExecutor.execute(WrapperExecutor.java:122) [ERROR] at org.apache.maven.wrapper.MavenWrapperMain.main(MavenWrapperMain.java:61) ```
04 / LABELS
Labels from the report text only; not yet run
No supported category has been assigned.
Label rules and the text that matched
[]