← All tasks
cppMotion-Project/motion #342Not a task: not reproduced

mac build broke again

envgap__Motion-Project__motion-342

01 / FAILURE SIGNATURE

As reported upstream

clang: error: linker command failed with exit code 1 (use -v to see invocation)
Not a benchmark task.
  • In a clean container the reported failure did not reproduce, or the known fix did not make the project run.

02 / ENVIRONMENT RECIPE

Base commit
8a1b9a982e7fe8a821c83a9f44e1d8bbb65581a8
Manifest
CMakeLists.txt
Reproduce
Awaiting issue-specific recipe
Run under trace
Awaiting a meaningful runtime command

03 / ORIGINAL ISSUE TEXT

Motion-Project/motion #342 · read the original issue
I'm not exactly sure which commit (i can take a look when I get time) but the current head is broken for mac:



```

[100%] Linking C executable motion

Undefined symbols for architecture x86_64:

  "_avdevice_register_all", referenced from:

      _ffmpeg_global_init in ffmpeg.c.o

ld: symbol(s) not found for architecture x86_64

clang: error: linker command failed with exit code 1 (use -v to see invocation)

make[2]: *** [motion] Error 1

make[1]: *** [CMakeFiles/motion.dir/all] Error 2

make: *** [all] Error 2

```



Going back to here fixes it:

4cecdd5f03a798d53503f396d37611b0b626365b

```

git reset --hard 4cecdd5f03a798d53503f396d37611b0b626365b

```

Continue on GitHub ↗

04 / LABELS

Labels from the report text only; not yet run

No supported category has been assigned.

Label rules and the text that matched
[]