ERROR when building → javax.interceptor depency no longer available at repo.jenkins-ci.org
envgap__frohoff__ysoserial-216
01 / FAILURE SIGNATURE
As reported upstream
[ERROR] Failed to execute goal on project ysoserial: Could not resolve dependencies for project ysoserial:ysoserial:jar:0.0.6-SNAPSHOT: javax.interceptor:javax.interceptor-api:jar:3.1 was not found in https://repo.jenkins-ci.org/public/ during a previous attempt. This failure was cached in the local repository and resolution is not reattempted until the update interval of jenkins has elapsed or updates are forced -> [Help 1]
Not a benchmark task.
- In a clean container the reported failure did not reproduce, or the known fix did not make the project run.
02 / ENVIRONMENT RECIPE
- Base commit
2874a69f6127fd3b3f078461741910423a6b1376- Manifest
pom.xml- Reproduce
Awaiting issue-specific recipe- Run under trace
Awaiting a meaningful runtime command
03 / ORIGINAL ISSUE TEXT
frohoff/ysoserial #216 · read the original issue
It's impossible to build from source according to instructions because the dependency **javax.interceptor:javax.interceptor-api:jar:3.1** is no longer present at https://repo.jenkins-ci.org/public/. ``` u54deliv2f@localhost:~/ysoserial$ mvn clean package -DskipTests [INFO] Scanning for projects... [INFO] [INFO] ------------------------< ysoserial:ysoserial >------------------------- [INFO] Building ysoserial 0.0.6-SNAPSHOT [INFO] --------------------------------[ jar ]--------------------------------- [WARNING] The POM for javax.interceptor:javax.interceptor-api:jar:3.1 is missing, no dependency information available [INFO] ------------------------------------------------------------------------ [INFO] BUILD FAILURE [INFO] ------------------------------------------------------------------------ [INFO] Total time: 0.450 s [INFO] Finished at: 2024-03-09T13:44:05Z [INFO] ------------------------------------------------------------------------ [ERROR] Failed to execute goal on project ysoserial: Could not resolve dependencies for project ysoserial:ysoserial:jar:0.0.6-SNAPSHOT: javax.interceptor:javax.interceptor-api:jar:3.1 was not found in https://repo.jenkins-ci.org/public/ during a previous attempt. This failure was cached in the local repository and resolution is not reattempted until the update interval of jenkins has elapsed or updates are forced -> [Help 1] [ERROR] [ERROR] To see the full stack trace of the errors, re-run Maven with the -e switch. [ERROR] Re-run Maven using the -X switch to enable full debug logging. [ERROR] [ERROR] For more information about the errors and possible solutions, please read the following articles: [ERROR] [Help 1] http://cwiki.apache.org/confluence/display/MAVEN/DependencyResolutionException ``` Any workaround for a successful build?
04 / LABELS
Labels from the report text only; not yet run
No supported category has been assigned.
Label rules and the text that matched
[]