← All tasks
cppfacebook/folly #905Not a task: not reproduced

build error

envgap__facebook__folly-905

Original GitHub issue ↗Opened 2018-08-06

01 / FAILURE SIGNATURE

As reported upstream

/home/kosh/work/folly/folly/experimental/symbolizer/Dwarf.cpp:24:10: fatal error: dwarf.h: Нет такого файла или каталога
Not a benchmark task.
  • No curated issue-specific recipe or verified environment fix is available.

02 / ENVIRONMENT RECIPE

Base commit
Not freshly verified
Manifest
CMakeLists.txt
Reproduce
Awaiting issue-specific recipe
Run under trace
Awaiting a meaningful runtime command

03 / ORIGINAL ISSUE TEXT

facebook/folly #905 · read the original issue
kosh@kosh:~/work/folly/_build5$ cmake .. 

- Boost version: 1.65.1

- Found the following Boost libraries:

-   context

-   chrono

-   date_time

-   filesystem

-   program_options

-   regex

-   system

-   thread

-   atomic

- Found double-conversion: /usr/lib/x86_64-linux-gnu/libdouble-conversion.so

- Found libevent: /usr/lib/x86_64-linux-gnu/libevent.so

- Found LZ4: /usr/lib/x86_64-linux-gnu/liblz4.so

- Found Zstd: /usr/lib/x86_64-linux-gnu/libzstd.so

- Setting FOLLY_USE_SYMBOLIZER: ON

- Configuring done

- Generating done

- Build files have been written to: /home/kosh/work/folly/_build5

kosh@kosh:~/work/folly/_build5$ make -j3

[  0%] Building CXX object CMakeFiles/folly_base.dir/folly/experimental/symbolizer/ElfCache.cpp.o

[  0%] Building CXX object CMakeFiles/folly_base.dir/folly/experimental/symbolizer/Dwarf.cpp.o

[  0%] Building CXX object CMakeFiles/folly_base.dir/folly/experimental/symbolizer/Elf.cpp.o

/home/kosh/work/folly/folly/experimental/symbolizer/Dwarf.cpp:24:10: fatal error: dwarf.h: Нет такого файла или каталога

 #include <dwarf.h> // @manual

          ^~~~~~~~~

compilation terminated.

CMakeFiles/folly_base.dir/build.make:1934: recipe for target 'CMakeFiles/folly_base.dir/folly/experimental/symbolizer/Dwarf.cpp.o' failed

make[2]: *** [CMakeFiles/folly_base.dir/folly/experimental/symbolizer/Dwarf.cpp.o] Error 1

make[2]: *** Ожидание завершения заданий…

CMakeFiles/Makefile2:3148: recipe for target 'CMakeFiles/folly_base.dir/all' failed

make[1]: *** [CMakeFiles/folly_base.dir/all] Error 2

Makefile:140: recipe for target 'all' failed

make: *** [all] Error 2

Continue on GitHub ↗

04 / LABELS

Labels from the report text only; not yet run

No supported category has been assigned.

Label rules and the text that matched
[]

Issue-specific recipe and runtime smoke command require review against the complete issue and repository.

Legacy reproduction is generic install-only; match the actual issue failure before admission.