[Build] CUDA UBUNTU 16
envgap__arrayfire__arrayfire-2956
01 / FAILURE SIGNATURE
As reported upstream
/home/turgut/Documents/arrayfire/src/backend/cuda/cusparse.hpp(22): error: identifier "cusparseDnVecDescr_t" is undefined
Not a benchmark task.
- In a clean container the reported failure did not reproduce, or the known fix did not make the project run.
02 / ENVIRONMENT RECIPE
- Base commit
04ad81379002669a37abda849a6f1e77c08c7d40- Manifest
test/CMakeLists.txt- Reproduce
Awaiting issue-specific recipe- Run under trace
Awaiting a meaningful runtime command
03 / ORIGINAL ISSUE TEXT
arrayfire/arrayfire #2956 · read the original issue
<!-- A short one or two line description of the error --> Description =========== Hi. I cloned the repo again. But now I get the following. ~Related to https://github.com/arrayfire/arrayfire/issues/2951~ <!-- * Additional details about the errors during the build * What do you suspect is causing the issue? * Which steps in the (wiki)[https://github.com/arrayfire/arrayfire/wiki] failed * What operating system and/or distro are you using? * Versions of the packages related to this bug --> Error Log --------- <!-- Output of the error log. --> ``` [ 8%] Building NVCC (Device) object src/backend/cuda/CMakeFiles/af_cuda_static_cuda_library.dir/af_cuda_static_cuda_library_generated_solve.cu.o [ 8%] Building NVCC (Device) object src/backend/cuda/CMakeFiles/af_cuda_static_cuda_library.dir/af_cuda_static_cuda_library_generated_blas.cu.o [ 8%] Building NVCC (Device) object src/backend/cuda/CMakeFiles/af_cuda_static_cuda_library.dir/af_cuda_static_cuda_library_generated_cufft.cu.o [ 8%] Building NVCC (Device) object src/backend/cuda/CMakeFiles/af_cuda_static_cuda_library.dir/af_cuda_static_cuda_library_generated_fft.cu.o [ 8%] Building NVCC (Device) object src/backend/cuda/CMakeFiles/af_cuda_static_cuda_library.dir/af_cuda_static_cuda_library_generated_sparse.cu.o /home/turgut/Documents/arrayfire/src/backend/cuda/cusparse.hpp(22): error: identifier "cusparseDnVecDescr_t" is undefined /home/turgut/Documents/arrayfire/src/backend/cuda/cusparse.hpp(22): error: identifier "cusparseDnVecDescr_t" is undefined /home/turgut/Documents/arrayfire/src/backend/cuda/cusparse.hpp(22): error: identifier "cusparseDnVecDescr_t" is undefined /home/turgut/Documents/arrayfire/src/backend/cuda/cusparse.hpp(22): error: identifier "cusparseDestroyDnVec" is undefined 4 errors detected in the compilation of "/tmp/tmpxft_000011f1_00000000-6_sparse.cpp1.ii". CMake Error at af_cuda_static_cuda_library_generated_sparse.cu.o.cmake:266 (message): Error generating file /home/turgut/Documents/arrayfire/build/src/backend/cuda/CMakeFiles/af_cuda_static_cuda_library.dir//./af_cuda_static_cuda_library_generated_sparse.cu.o src/backend/cuda/CMakeFiles/af_cuda_static_cuda_library.dir/build.make:84: recipe for target 'src/backend/cuda/CMakeFiles/af_cuda_static_cuda_library.dir/af_cuda_static_cuda_library_generated_sparse.cu.o' failed make[2]: *** [src/backend/cuda/CMakeFiles/af_cuda_static_cuda_library.dir/af_cuda_static_cuda_library_generated_sparse.cu.o] Error 1 CMakeFiles/Makefile2:1204: recipe for target 'src/backend/cuda/CMakeFiles/af_cuda_static_cuda_library.dir/all' failed make[1]: *** [src/backend/cuda/CMakeFiles/af_cuda_static_cuda_library.dir/all] Error 2 Makefile:160: recipe for target 'all' failed make: *** [all] Error 2 turgut@turgut:~/Documents/arrayfire/build$ ``` Build Environment ----------------- Compiler version: <!-- MSVC v140 or gcc 9.3.2 --> Operating system: <!-- Windows 10; Ubuntu 18.04 --> Build environment: <!-- Environment variables; Installed software --> CMake variables: <!-- Output of `cmake -L` -->
04 / LABELS
Labels from the report text only; not yet run
No supported category has been assigned.
Label rules and the text that matched
[]