← All tasks
cpplibigl/libigl #2014Not a task: not reproduced

[CMakeFiles/gmp.dir/build.make:98: _deps/gmp/src/gmp-stamp/gmp-patch] Error 128

envgap__libigl__libigl-2014

01 / FAILURE SIGNATURE

As reported upstream

error: can't open patch 'build/_deps/gmp/src/gmp/CONFIGURE_HANDLED_BY_BUILD': No such file or directory
Not a benchmark task.
  • In a clean container the reported failure did not reproduce, or the known fix did not make the project run.

02 / ENVIRONMENT RECIPE

Base commit
dbecea2bc4f0eb89fcb5465a180079561754e76c
Manifest
CMakeLists.txt
Reproduce
Awaiting issue-specific recipe
Run under trace
Awaiting a meaningful runtime command

03 / ORIGINAL ISSUE TEXT

libigl/libigl #2014 · read the original issue
#### Describe the bug

<!-- A clear and concise description of what the bug is. -->

I **build all the examples in the tutorial** in ubuntu 21.10 follow these:

```

git clone https://github.com/libigl/libigl.git

cd libigl/

mkdir build

cd build

cmake ../

make

```

But when I conduct the  `make` command, I encounted the error like this:



```



[  0%] Built target predicates

[ 43%] Built target igl_core

[ 44%] Built target igl_predicates

[ 45%] Built target test_igl_predicates

[ 47%] Built target Boost_system

[ 47%] Built target igl_copyleft_core

[ 47%] Performing patch step for 'gmp'

error: can't open patch 'build/_deps/gmp/src/gmp/CONFIGURE_HANDLED_BY_BUILD': No such file or directory

  % Total    % Received % Xferd  Average Speed   Time    Time     Time  Current

                                 Dload  Upload   Total   Spent    Left  Speed

100 11061    0 11061    0     0   6419      0 --:--:--  0:00:01 --:--:--  6415

curl: (23) Failed writing body (0 != 11061)

make[2]: *** [CMakeFiles/gmp.dir/build.make:98: _deps/gmp/src/gmp-stamp/gmp-patch] Error 128

make[1]: *** [CMakeFiles/Makefile2:1920: CMakeFiles/gmp.dir/all] Error 2

make: *** [Makefile:163: all] Error 2_

```





#### Platform

<!-- Check all that apply (change to `[x]`) -->



- [ ] Windows

- [ ] macOS

- [x] Linux

Continue on GitHub ↗

04 / LABELS

Labels from the report text only; not yet run

No supported category has been assigned.

Label rules and the text that matched
[]