mvn build failed (501 HTTPS Required)
envgap__deathmarine__Luyten-238
01 / FAILURE SIGNATURE
As reported upstream
[ERROR] Failed to execute goal on project luyten: Could not resolve dependencies for project us.deathmarine:luyten:jar:0.5.4: Failed to collect dependencies at org.bitbucket.mstrobel:procyon-core:jar:0.5.36: Failed to read artifact descriptor for org.bitbucket.mstrobel:procyon-core:jar:0.5.36: Could not transfer artifact org.bitbucket.mstrobel:procyon-core:pom:0.5.36 from/to central (http://repo.maven.apache.org/maven2): Failed to transfer file http://repo.maven.apache.org/maven2/org/bitbucket/mstrobel/procyon-core/0.5.36/procyon-core-0.5.36.pom with status code 501 -> [Help 1]
Not a benchmark task.
- In a clean container the reported failure did not reproduce, or the known fix did not make the project run.
02 / ENVIRONMENT RECIPE
- Base commit
a8622231d7c7fef9e780edd0acb80410b9ba3c73- Manifest
pom.xml- Reproduce
Awaiting issue-specific recipe- Run under trace
Awaiting a meaningful runtime command
03 / ORIGINAL ISSUE TEXT
deathmarine/Luyten #238 · read the original issue
Following build error: ``` [ERROR] Failed to execute goal on project luyten: Could not resolve dependencies for project us.deathmarine:luyten:jar:0.5.4: Failed to collect dependencies at org.bitbucket.mstrobel:procyon-core:jar:0.5.36: Failed to read artifact descriptor for org.bitbucket.mstrobel:procyon-core:jar:0.5.36: Could not transfer artifact org.bitbucket.mstrobel:procyon-core:pom:0.5.36 from/to central (http://repo.maven.apache.org/maven2): Failed to transfer file http://repo.maven.apache.org/maven2/org/bitbucket/mstrobel/procyon-core/0.5.36/procyon-core-0.5.36.pom with status code 501 -> [Help 1] ``` You need to change all ```http://``` to ```https://``` in *pom.xml*, then build is OK :)
04 / LABELS
Labels from the report text only; not yet run
No supported category has been assigned.
Label rules and the text that matched
[]